Flod  FLOD Testing | taskwarrior 2.6.0

Arch 2016
64-bit
GCC 6.2.1
CMake 3.6.2
Python 3.5.2
CentOS 7
64-bit
GCC 4.8.5
CMake 3.10.1
Python 2.7.5
Debian Stable
64-bit
GCC 6.3.0
CMake 3.7.2
Python 2.7.13
Fedora 27
64-bit
GCC 7.2.1
CMake 3.10.1
Python 2.7.14
macOS 10.13 High Sierra
64-bit
Clang 900
CMake 3.9.4
Python 2.7.10
Ubuntu 16.10
64-bit
GCC 6.2.0
CMake 3.5.2
Python 2.7.12
2019-04-14T23:40:55Z
  d01000e2
  Paul Beckingham
0.00% 0/0
0.38s
0.00% 0/0
16.38s
0.00% 0/0
0.26s
99.46% 3873/3894
W T
"/tmp/taskwarrior.d01000e255d5d99c9675229d0b52bc3f543615bb/taskwarrior.git/src/Variant.cpp:1113:7: warning: this statement may fall through [-Wimplicit-fallthrough=]"
"/tmp/taskwarrior.d01000e255d5d99c9675229d0b52bc3f543615bb/taskwarrior.git/src/recur2.cpp:47:13: warning: \u2018Task upgradeTask(const Task&)\u2019 defined but not used [-Wunused-function]"
"not ok 2 - quotes.t: 1436: Task created but not found with ending backslash"
"not ok 3 - quotes.t: 1436: Parser hangs with backslashes"
"not ok 20 - search.t: 1479: Verify that a description of 'one two' is searchable"
"# ERROR: CommandError on file /tmp/taskwarrior.d01000e255d5d99c9675229d0b52bc3f543615bb/taskwarrior.git/test/search.t line 257 in test_description_with_spaces: 'code, out, err = self.t(\"description:one\\ two list\")':"
"not ok 5 - project.t: 1455: Test project:school) # TODO"
"not ok 7 - project.t: 1617: Verify search for multi-word project"
"# ERROR: CommandError on file /tmp/taskwarrior.d01000e255d5d99c9675229d0b52bc3f543615bb/taskwarrior.git/test/project.t line 467 in test_multi_word_project: 'code, out, err = self.t(\"project:'three four' list\")':"
"not ok 2 - hyphenate.t: Verify hyphenation in the absence of white space # TODO"
"not ok 1 - feature.default.project.t: default.project is not applied to projectless tasks during sync"
"# ERROR: CommandError on file /tmp/taskwarrior.d01000e255d5d99c9675229d0b52bc3f543615bb/taskwarrior.git/test/feature.default.project.t line 246 in test_default_project_sync: 'self.t1(\"sync\")':"
"not ok 21 - filter.t: filter - description contains +"
"# ERROR: CommandError on file /tmp/taskwarrior.d01000e255d5d99c9675229d0b52bc3f543615bb/taskwarrior.git/test/filter.t line 673 in test_filter_plus_in_descriptions: 'code, out, err = self.t(\"all description.contains:'foobar\\\\+'\")':"
"not ok 24 - filter.t: 1630: Verify that 'due.before:9d' is correctly interpreted"
"# ERROR: CommandError on file /tmp/taskwarrior.d01000e255d5d99c9675229d0b52bc3f543615bb/taskwarrior.git/test/filter.t line 979 in test_attribute_modifier_with_duration: 'code, out, err = self.t(\"due.before:9d list rc.verbose:nothing\")':"
"not ok 25 - filter.t: 1630: Verify that 'due:7d' is correctly interpreted"
"# ERROR: CommandError on file /tmp/taskwarrior.d01000e255d5d99c9675229d0b52bc3f543615bb/taskwarrior.git/test/filter.t line 986 in test_attribute_no_modifier_with_duration: 'code, out, err = self.t(\"due:7d list rc.verbose:nothing\")':"
"not ok 29 - filter.t: 1915: Make sure parser handles complex and-or queries correctly (4)"
"# ERROR: CommandError on file /tmp/taskwarrior.d01000e255d5d99c9675229d0b52bc3f543615bb/taskwarrior.git/test/filter.t line 1069 in test_complex_and_or_query_variant_four: 'code, out, err = self.t(\"rc.verbose:nothing 'status:pending and ( project:A or project:B )' all\")':"
"not ok 33 - filter.t: 1915: Make sure parser handles complex and-or queries correctly (3)"
"# ERROR: CommandError on file /tmp/taskwarrior.d01000e255d5d99c9675229d0b52bc3f543615bb/taskwarrior.git/test/filter.t line 1062 in test_complex_and_or_query_variant_three: 'code, out, err = self.t(\"rc.verbose:nothing 'status:pending and (project:A or project:B)' all\")':"
"not ok 2 - dateformat.t: 886: Test invalid day synonym"
"not ok 7 - dependencies.t: 697: Verify that making a blocking task into a recurring task breaks dependencies # TODO"
"not ok 18 - dependencies.t: Check that an ID range can be used for deps # TODO"
"not ok 19 - dependencies.t: Check that IDs and UUIDs are both usable for deps"
"not ok 3 - bash_completion.t: no gc coming from bash completion"
"not ok 4 - bash_completion.t: project: should be expanded and dependent on abbreviation minimum"
"# ERROR: AssertionError:"
"not ok 5 - bash_completion.t: project: expansion expanded after rc.abbreviation.minimum"
"# ERROR: AssertionError:"
"not ok 6 - bash_completion.t: project: fails if shorter than rc.abbreviation.minimum"
"# ERROR: AssertionError:"
"not ok 7 - bash_completion.t: project: expansion fails on non matching attribute"
"# ERROR: AssertionError:"
"not ok 1 - add.t: 1549: The token '1e ' left the lexer in a bad state."
186.07s
0.00% 0/0
0.02s
0.00% 0/0
0.27s
2019-04-14T23:38:01Z
  66f013ac
  Paul Beckingham
0.00% 0/0
0.28s
0.00% 0/0
16.21s
0.00% 0/0
0.30s
99.49% 3874/3894
W T
"/tmp/taskwarrior.66f013ac1343c1a4aab3a0523dbe910c60d16bba/taskwarrior.git/src/Variant.cpp:1113:7: warning: this statement may fall through [-Wimplicit-fallthrough=]"
"/tmp/taskwarrior.66f013ac1343c1a4aab3a0523dbe910c60d16bba/taskwarrior.git/src/recur2.cpp:47:13: warning: \u2018Task upgradeTask(const Task&)\u2019 defined but not used [-Wunused-function]"
"not ok 3 - quotes.t: 1436: Parser hangs with backslashes"
"not ok 20 - search.t: 1479: Verify that a description of 'one two' is searchable"
"# ERROR: CommandError on file /tmp/taskwarrior.66f013ac1343c1a4aab3a0523dbe910c60d16bba/taskwarrior.git/test/search.t line 257 in test_description_with_spaces: 'code, out, err = self.t(\"description:one\\ two list\")':"
"not ok 5 - project.t: 1455: Test project:school) # TODO"
"not ok 7 - project.t: 1617: Verify search for multi-word project"
"# ERROR: CommandError on file /tmp/taskwarrior.66f013ac1343c1a4aab3a0523dbe910c60d16bba/taskwarrior.git/test/project.t line 467 in test_multi_word_project: 'code, out, err = self.t(\"project:'three four' list\")':"
"not ok 2 - hyphenate.t: Verify hyphenation in the absence of white space # TODO"
"not ok 1 - feature.default.project.t: default.project is not applied to projectless tasks during sync"
"# ERROR: CommandError on file /tmp/taskwarrior.66f013ac1343c1a4aab3a0523dbe910c60d16bba/taskwarrior.git/test/feature.default.project.t line 246 in test_default_project_sync: 'self.t1(\"sync\")':"
"not ok 21 - filter.t: filter - description contains +"
"# ERROR: CommandError on file /tmp/taskwarrior.66f013ac1343c1a4aab3a0523dbe910c60d16bba/taskwarrior.git/test/filter.t line 673 in test_filter_plus_in_descriptions: 'code, out, err = self.t(\"all description.contains:'foobar\\\\+'\")':"
"not ok 24 - filter.t: 1630: Verify that 'due.before:9d' is correctly interpreted"
"# ERROR: CommandError on file /tmp/taskwarrior.66f013ac1343c1a4aab3a0523dbe910c60d16bba/taskwarrior.git/test/filter.t line 979 in test_attribute_modifier_with_duration: 'code, out, err = self.t(\"due.before:9d list rc.verbose:nothing\")':"
"not ok 25 - filter.t: 1630: Verify that 'due:7d' is correctly interpreted"
"# ERROR: CommandError on file /tmp/taskwarrior.66f013ac1343c1a4aab3a0523dbe910c60d16bba/taskwarrior.git/test/filter.t line 986 in test_attribute_no_modifier_with_duration: 'code, out, err = self.t(\"due:7d list rc.verbose:nothing\")':"
"not ok 29 - filter.t: 1915: Make sure parser handles complex and-or queries correctly (4)"
"# ERROR: CommandError on file /tmp/taskwarrior.66f013ac1343c1a4aab3a0523dbe910c60d16bba/taskwarrior.git/test/filter.t line 1069 in test_complex_and_or_query_variant_four: 'code, out, err = self.t(\"rc.verbose:nothing 'status:pending and ( project:A or project:B )' all\")':"
"not ok 33 - filter.t: 1915: Make sure parser handles complex and-or queries correctly (3)"
"# ERROR: CommandError on file /tmp/taskwarrior.66f013ac1343c1a4aab3a0523dbe910c60d16bba/taskwarrior.git/test/filter.t line 1062 in test_complex_and_or_query_variant_three: 'code, out, err = self.t(\"rc.verbose:nothing 'status:pending and (project:A or project:B)' all\")':"
"not ok 2 - dateformat.t: 886: Test invalid day synonym"
"not ok 7 - dependencies.t: 697: Verify that making a blocking task into a recurring task breaks dependencies # TODO"
"not ok 18 - dependencies.t: Check that an ID range can be used for deps # TODO"
"not ok 19 - dependencies.t: Check that IDs and UUIDs are both usable for deps"
"not ok 3 - bash_completion.t: no gc coming from bash completion"
"# ERROR: AssertionError:"
"not ok 4 - bash_completion.t: project: should be expanded and dependent on abbreviation minimum"
"# ERROR: AssertionError:"
"not ok 5 - bash_completion.t: project: expansion expanded after rc.abbreviation.minimum"
"# ERROR: AssertionError:"
"not ok 6 - bash_completion.t: project: fails if shorter than rc.abbreviation.minimum"
"# ERROR: AssertionError:"
"not ok 7 - bash_completion.t: project: expansion fails on non matching attribute"
"# ERROR: AssertionError:"
"not ok 1 - add.t: 1549: The token '1e ' left the lexer in a bad state."
185.02s
0.00% 0/0
0.02s
0.00% 0/0
0.20s
2019-04-14T23:34:57Z
  cd62e65a
  Chad Phillips
0.00% 0/0
0.32s
0.00% 0/0
16.92s
0.00% 0/0
0.56s
99.51% 3875/3894
W T
"/tmp/taskwarrior.cd62e65a13b404ecc7459d458bec8fd73f74d1b5/taskwarrior.git/src/Variant.cpp:1113:7: warning: this statement may fall through [-Wimplicit-fallthrough=]"
"/tmp/taskwarrior.cd62e65a13b404ecc7459d458bec8fd73f74d1b5/taskwarrior.git/src/recur2.cpp:47:13: warning: \u2018Task upgradeTask(const Task&)\u2019 defined but not used [-Wunused-function]"
"not ok 3 - quotes.t: 1436: Parser hangs with backslashes"
"not ok 20 - search.t: 1479: Verify that a description of 'one two' is searchable"
"# ERROR: CommandError on file /tmp/taskwarrior.cd62e65a13b404ecc7459d458bec8fd73f74d1b5/taskwarrior.git/test/search.t line 257 in test_description_with_spaces: 'code, out, err = self.t(\"description:one\\ two list\")':"
"not ok 5 - project.t: 1455: Test project:school) # TODO"
"not ok 7 - project.t: 1617: Verify search for multi-word project"
"# ERROR: CommandError on file /tmp/taskwarrior.cd62e65a13b404ecc7459d458bec8fd73f74d1b5/taskwarrior.git/test/project.t line 467 in test_multi_word_project: 'code, out, err = self.t(\"project:'three four' list\")':"
"not ok 2 - hyphenate.t: Verify hyphenation in the absence of white space # TODO"
"not ok 1 - feature.default.project.t: default.project is not applied to projectless tasks during sync"
"# ERROR: CommandError on file /tmp/taskwarrior.cd62e65a13b404ecc7459d458bec8fd73f74d1b5/taskwarrior.git/test/feature.default.project.t line 246 in test_default_project_sync: 'self.t1(\"sync\")':"
"not ok 21 - filter.t: filter - description contains +"
"# ERROR: CommandError on file /tmp/taskwarrior.cd62e65a13b404ecc7459d458bec8fd73f74d1b5/taskwarrior.git/test/filter.t line 673 in test_filter_plus_in_descriptions: 'code, out, err = self.t(\"all description.contains:'foobar\\\\+'\")':"
"not ok 24 - filter.t: 1630: Verify that 'due.before:9d' is correctly interpreted"
"# ERROR: CommandError on file /tmp/taskwarrior.cd62e65a13b404ecc7459d458bec8fd73f74d1b5/taskwarrior.git/test/filter.t line 979 in test_attribute_modifier_with_duration: 'code, out, err = self.t(\"due.before:9d list rc.verbose:nothing\")':"
"not ok 25 - filter.t: 1630: Verify that 'due:7d' is correctly interpreted"
"# ERROR: CommandError on file /tmp/taskwarrior.cd62e65a13b404ecc7459d458bec8fd73f74d1b5/taskwarrior.git/test/filter.t line 986 in test_attribute_no_modifier_with_duration: 'code, out, err = self.t(\"due:7d list rc.verbose:nothing\")':"
"not ok 29 - filter.t: 1915: Make sure parser handles complex and-or queries correctly (4)"
"# ERROR: CommandError on file /tmp/taskwarrior.cd62e65a13b404ecc7459d458bec8fd73f74d1b5/taskwarrior.git/test/filter.t line 1069 in test_complex_and_or_query_variant_four: 'code, out, err = self.t(\"rc.verbose:nothing 'status:pending and ( project:A or project:B )' all\")':"
"not ok 33 - filter.t: 1915: Make sure parser handles complex and-or queries correctly (3)"
"# ERROR: CommandError on file /tmp/taskwarrior.cd62e65a13b404ecc7459d458bec8fd73f74d1b5/taskwarrior.git/test/filter.t line 1062 in test_complex_and_or_query_variant_three: 'code, out, err = self.t(\"rc.verbose:nothing 'status:pending and (project:A or project:B)' all\")':"
"not ok 2 - dateformat.t: 886: Test invalid day synonym"
"not ok 7 - dependencies.t: 697: Verify that making a blocking task into a recurring task breaks dependencies # TODO"
"not ok 18 - dependencies.t: Check that an ID range can be used for deps # TODO"
"not ok 19 - dependencies.t: Check that IDs and UUIDs are both usable for deps"
"not ok 3 - bash_completion.t: no gc coming from bash completion"
"# ERROR: AssertionError:"
"not ok 4 - bash_completion.t: project: should be expanded and dependent on abbreviation minimum"
"# ERROR: AssertionError:"
"not ok 5 - bash_completion.t: project: expansion expanded after rc.abbreviation.minimum"
"# ERROR: AssertionError:"
"not ok 7 - bash_completion.t: project: expansion fails on non matching attribute"
"# ERROR: AssertionError:"
"not ok 1 - add.t: 1549: The token '1e ' left the lexer in a bad state."
188.79s
0.00% 0/0
0.05s
0.00% 0/0
0.47s
2019-03-03T13:55:28Z
  e961181b Locked
  Lionel Miller
0.00% 0/0
0.47s
0.00% 0/0
16.90s
0.00% 0/0
0.67s
99.46% 3873/3894
W T
"/tmp/taskwarrior.e961181b645bff735e02a833236946ba3501f88f/taskwarrior.git/src/Variant.cpp:1113:7: warning: this statement may fall through [-Wimplicit-fallthrough=]"
"/tmp/taskwarrior.e961181b645bff735e02a833236946ba3501f88f/taskwarrior.git/src/recur2.cpp:47:13: warning: \u2018Task upgradeTask(const Task&)\u2019 defined but not used [-Wunused-function]"
"not ok 2 - quotes.t: 1436: Task created but not found with ending backslash"
"not ok 3 - quotes.t: 1436: Parser hangs with backslashes"
"not ok 20 - search.t: 1479: Verify that a description of 'one two' is searchable"
"# ERROR: CommandError on file /tmp/taskwarrior.e961181b645bff735e02a833236946ba3501f88f/taskwarrior.git/test/search.t line 257 in test_description_with_spaces: 'code, out, err = self.t(\"description:one\\ two list\")':"
"not ok 5 - project.t: 1455: Test project:school) # TODO"
"not ok 7 - project.t: 1617: Verify search for multi-word project"
"# ERROR: CommandError on file /tmp/taskwarrior.e961181b645bff735e02a833236946ba3501f88f/taskwarrior.git/test/project.t line 467 in test_multi_word_project: 'code, out, err = self.t(\"project:'three four' list\")':"
"not ok 2 - hyphenate.t: Verify hyphenation in the absence of white space # TODO"
"not ok 1 - feature.default.project.t: default.project is not applied to projectless tasks during sync"
"# ERROR: CommandError on file /tmp/taskwarrior.e961181b645bff735e02a833236946ba3501f88f/taskwarrior.git/test/feature.default.project.t line 246 in test_default_project_sync: 'self.t1(\"sync\")':"
"not ok 21 - filter.t: filter - description contains +"
"# ERROR: CommandError on file /tmp/taskwarrior.e961181b645bff735e02a833236946ba3501f88f/taskwarrior.git/test/filter.t line 673 in test_filter_plus_in_descriptions: 'code, out, err = self.t(\"all description.contains:'foobar\\\\+'\")':"
"not ok 24 - filter.t: 1630: Verify that 'due.before:9d' is correctly interpreted"
"# ERROR: CommandError on file /tmp/taskwarrior.e961181b645bff735e02a833236946ba3501f88f/taskwarrior.git/test/filter.t line 979 in test_attribute_modifier_with_duration: 'code, out, err = self.t(\"due.before:9d list rc.verbose:nothing\")':"
"not ok 25 - filter.t: 1630: Verify that 'due:7d' is correctly interpreted"
"# ERROR: CommandError on file /tmp/taskwarrior.e961181b645bff735e02a833236946ba3501f88f/taskwarrior.git/test/filter.t line 986 in test_attribute_no_modifier_with_duration: 'code, out, err = self.t(\"due:7d list rc.verbose:nothing\")':"
"not ok 29 - filter.t: 1915: Make sure parser handles complex and-or queries correctly (4)"
"# ERROR: CommandError on file /tmp/taskwarrior.e961181b645bff735e02a833236946ba3501f88f/taskwarrior.git/test/filter.t line 1069 in test_complex_and_or_query_variant_four: 'code, out, err = self.t(\"rc.verbose:nothing 'status:pending and ( project:A or project:B )' all\")':"
"not ok 33 - filter.t: 1915: Make sure parser handles complex and-or queries correctly (3)"
"# ERROR: CommandError on file /tmp/taskwarrior.e961181b645bff735e02a833236946ba3501f88f/taskwarrior.git/test/filter.t line 1062 in test_complex_and_or_query_variant_three: 'code, out, err = self.t(\"rc.verbose:nothing 'status:pending and (project:A or project:B)' all\")':"
"not ok 2 - dateformat.t: 886: Test invalid day synonym"
"not ok 7 - dependencies.t: 697: Verify that making a blocking task into a recurring task breaks dependencies # TODO"
"not ok 18 - dependencies.t: Check that an ID range can be used for deps # TODO"
"not ok 19 - dependencies.t: Check that IDs and UUIDs are both usable for deps"
"not ok 3 - bash_completion.t: no gc coming from bash completion"
"# ERROR: AssertionError:"
"not ok 4 - bash_completion.t: project: should be expanded and dependent on abbreviation minimum"
"# ERROR: AssertionError:"
"not ok 5 - bash_completion.t: project: expansion expanded after rc.abbreviation.minimum"
"# ERROR: AssertionError:"
"not ok 6 - bash_completion.t: project: fails if shorter than rc.abbreviation.minimum"
"# ERROR: AssertionError:"
"not ok 7 - bash_completion.t: project: expansion fails on non matching attribute"
"# ERROR: AssertionError:"
"not ok 1 - add.t: 1549: The token '1e ' left the lexer in a bad state."
195.03s
0.00% 0/0
0.04s
0.00% 0/0
0.56s
2019-03-03T00:52:49Z
  cb7f603b Locked
  Janik Rabe
0.00% 0/0
0.41s
0.00% 0/0
14.79s
0.00% 0/0
0.29s
99.46% 3873/3894
W T
"/tmp/taskwarrior.cb7f603b899d12c59a8237c95802c3c277307900/taskwarrior.git/src/Variant.cpp:1113:7: warning: this statement may fall through [-Wimplicit-fallthrough=]"
"/tmp/taskwarrior.cb7f603b899d12c59a8237c95802c3c277307900/taskwarrior.git/src/recur2.cpp:47:13: warning: \u2018Task upgradeTask(const Task&)\u2019 defined but not used [-Wunused-function]"
"not ok 2 - quotes.t: 1436: Task created but not found with ending backslash"
"not ok 3 - quotes.t: 1436: Parser hangs with backslashes"
"not ok 20 - search.t: 1479: Verify that a description of 'one two' is searchable"
"# ERROR: CommandError on file /tmp/taskwarrior.cb7f603b899d12c59a8237c95802c3c277307900/taskwarrior.git/test/search.t line 257 in test_description_with_spaces: 'code, out, err = self.t(\"description:one\\ two list\")':"
"not ok 5 - project.t: 1455: Test project:school) # TODO"
"not ok 7 - project.t: 1617: Verify search for multi-word project"
"# ERROR: CommandError on file /tmp/taskwarrior.cb7f603b899d12c59a8237c95802c3c277307900/taskwarrior.git/test/project.t line 467 in test_multi_word_project: 'code, out, err = self.t(\"project:'three four' list\")':"
"not ok 2 - hyphenate.t: Verify hyphenation in the absence of white space # TODO"
"not ok 1 - feature.default.project.t: default.project is not applied to projectless tasks during sync"
"# ERROR: CommandError on file /tmp/taskwarrior.cb7f603b899d12c59a8237c95802c3c277307900/taskwarrior.git/test/feature.default.project.t line 246 in test_default_project_sync: 'self.t1(\"sync\")':"
"not ok 21 - filter.t: filter - description contains +"
"# ERROR: CommandError on file /tmp/taskwarrior.cb7f603b899d12c59a8237c95802c3c277307900/taskwarrior.git/test/filter.t line 673 in test_filter_plus_in_descriptions: 'code, out, err = self.t(\"all description.contains:'foobar\\\\+'\")':"
"not ok 24 - filter.t: 1630: Verify that 'due.before:9d' is correctly interpreted"
"# ERROR: CommandError on file /tmp/taskwarrior.cb7f603b899d12c59a8237c95802c3c277307900/taskwarrior.git/test/filter.t line 979 in test_attribute_modifier_with_duration: 'code, out, err = self.t(\"due.before:9d list rc.verbose:nothing\")':"
"not ok 25 - filter.t: 1630: Verify that 'due:7d' is correctly interpreted"
"# ERROR: CommandError on file /tmp/taskwarrior.cb7f603b899d12c59a8237c95802c3c277307900/taskwarrior.git/test/filter.t line 986 in test_attribute_no_modifier_with_duration: 'code, out, err = self.t(\"due:7d list rc.verbose:nothing\")':"
"not ok 29 - filter.t: 1915: Make sure parser handles complex and-or queries correctly (4)"
"# ERROR: CommandError on file /tmp/taskwarrior.cb7f603b899d12c59a8237c95802c3c277307900/taskwarrior.git/test/filter.t line 1069 in test_complex_and_or_query_variant_four: 'code, out, err = self.t(\"rc.verbose:nothing 'status:pending and ( project:A or project:B )' all\")':"
"not ok 33 - filter.t: 1915: Make sure parser handles complex and-or queries correctly (3)"
"# ERROR: CommandError on file /tmp/taskwarrior.cb7f603b899d12c59a8237c95802c3c277307900/taskwarrior.git/test/filter.t line 1062 in test_complex_and_or_query_variant_three: 'code, out, err = self.t(\"rc.verbose:nothing 'status:pending and (project:A or project:B)' all\")':"
"not ok 2 - dateformat.t: 886: Test invalid day synonym"
"not ok 7 - dependencies.t: 697: Verify that making a blocking task into a recurring task breaks dependencies # TODO"
"not ok 18 - dependencies.t: Check that an ID range can be used for deps # TODO"
"not ok 19 - dependencies.t: Check that IDs and UUIDs are both usable for deps"
"not ok 3 - bash_completion.t: no gc coming from bash completion"
"# ERROR: AssertionError:"
"not ok 4 - bash_completion.t: project: should be expanded and dependent on abbreviation minimum"
"# ERROR: AssertionError:"
"not ok 5 - bash_completion.t: project: expansion expanded after rc.abbreviation.minimum"
"# ERROR: AssertionError:"
"not ok 6 - bash_completion.t: project: fails if shorter than rc.abbreviation.minimum"
"# ERROR: AssertionError:"
"not ok 7 - bash_completion.t: project: expansion fails on non matching attribute"
"# ERROR: AssertionError:"
"not ok 1 - add.t: 1549: The token '1e ' left the lexer in a bad state."
190.14s
0.00% 0/0
0.02s
0.00% 0/0
0.30s
2019-03-03T00:44:18Z
  5aaee767 Locked
  mrossinek
0.00% 0/0
0.44s
0.00% 0/0
16.34s
0.00% 0/0
0.37s
99.51% 3875/3894
W T
"/tmp/taskwarrior.5aaee7678fe50d6636ebd0b703cf98a63241a535/taskwarrior.git/src/Variant.cpp:1113:7: warning: this statement may fall through [-Wimplicit-fallthrough=]"
"/tmp/taskwarrior.5aaee7678fe50d6636ebd0b703cf98a63241a535/taskwarrior.git/src/recur2.cpp:47:13: warning: \u2018Task upgradeTask(const Task&)\u2019 defined but not used [-Wunused-function]"
"not ok 2 - quotes.t: 1436: Task created but not found with ending backslash"
"not ok 20 - search.t: 1479: Verify that a description of 'one two' is searchable"
"# ERROR: CommandError on file /tmp/taskwarrior.5aaee7678fe50d6636ebd0b703cf98a63241a535/taskwarrior.git/test/search.t line 257 in test_description_with_spaces: 'code, out, err = self.t(\"description:one\\ two list\")':"
"not ok 5 - project.t: 1455: Test project:school) # TODO"
"not ok 7 - project.t: 1617: Verify search for multi-word project"
"# ERROR: CommandError on file /tmp/taskwarrior.5aaee7678fe50d6636ebd0b703cf98a63241a535/taskwarrior.git/test/project.t line 467 in test_multi_word_project: 'code, out, err = self.t(\"project:'three four' list\")':"
"not ok 2 - hyphenate.t: Verify hyphenation in the absence of white space # TODO"
"not ok 1 - feature.default.project.t: default.project is not applied to projectless tasks during sync"
"# ERROR: CommandError on file /tmp/taskwarrior.5aaee7678fe50d6636ebd0b703cf98a63241a535/taskwarrior.git/test/feature.default.project.t line 246 in test_default_project_sync: 'self.t1(\"sync\")':"
"not ok 21 - filter.t: filter - description contains +"
"# ERROR: CommandError on file /tmp/taskwarrior.5aaee7678fe50d6636ebd0b703cf98a63241a535/taskwarrior.git/test/filter.t line 673 in test_filter_plus_in_descriptions: 'code, out, err = self.t(\"all description.contains:'foobar\\\\+'\")':"
"not ok 24 - filter.t: 1630: Verify that 'due.before:9d' is correctly interpreted"
"# ERROR: CommandError on file /tmp/taskwarrior.5aaee7678fe50d6636ebd0b703cf98a63241a535/taskwarrior.git/test/filter.t line 979 in test_attribute_modifier_with_duration: 'code, out, err = self.t(\"due.before:9d list rc.verbose:nothing\")':"
"not ok 25 - filter.t: 1630: Verify that 'due:7d' is correctly interpreted"
"# ERROR: CommandError on file /tmp/taskwarrior.5aaee7678fe50d6636ebd0b703cf98a63241a535/taskwarrior.git/test/filter.t line 986 in test_attribute_no_modifier_with_duration: 'code, out, err = self.t(\"due:7d list rc.verbose:nothing\")':"
"not ok 29 - filter.t: 1915: Make sure parser handles complex and-or queries correctly (4)"
"# ERROR: CommandError on file /tmp/taskwarrior.5aaee7678fe50d6636ebd0b703cf98a63241a535/taskwarrior.git/test/filter.t line 1069 in test_complex_and_or_query_variant_four: 'code, out, err = self.t(\"rc.verbose:nothing 'status:pending and ( project:A or project:B )' all\")':"
"not ok 33 - filter.t: 1915: Make sure parser handles complex and-or queries correctly (3)"
"# ERROR: CommandError on file /tmp/taskwarrior.5aaee7678fe50d6636ebd0b703cf98a63241a535/taskwarrior.git/test/filter.t line 1062 in test_complex_and_or_query_variant_three: 'code, out, err = self.t(\"rc.verbose:nothing 'status:pending and (project:A or project:B)' all\")':"
"not ok 2 - dateformat.t: 886: Test invalid day synonym"
"not ok 7 - dependencies.t: 697: Verify that making a blocking task into a recurring task breaks dependencies # TODO"
"not ok 18 - dependencies.t: Check that an ID range can be used for deps # TODO"
"not ok 19 - dependencies.t: Check that IDs and UUIDs are both usable for deps"
"not ok 3 - bash_completion.t: no gc coming from bash completion"
"# ERROR: AssertionError:"
"not ok 5 - bash_completion.t: project: expansion expanded after rc.abbreviation.minimum"
"# ERROR: AssertionError:"
"not ok 6 - bash_completion.t: project: fails if shorter than rc.abbreviation.minimum"
"# ERROR: AssertionError:"
"not ok 7 - bash_completion.t: project: expansion fails on non matching attribute"
"# ERROR: AssertionError:"
"not ok 1 - add.t: 1549: The token '1e ' left the lexer in a bad state."
205.09s
0.00% 0/0
0.04s
0.00% 0/0
0.23s
2019-03-03T00:44:18Z
  6fbd400e Locked
  mrossinek
0.00% 0/0
0.30s
0.00% 0/0
30.62s
0.00% 0/0
0.36s
99.46% 3871/3892
W T
"/tmp/taskwarrior.6fbd400e77f7fc21e4829895df18191fafee0265/taskwarrior.git/src/Variant.cpp:1113:7: warning: this statement may fall through [-Wimplicit-fallthrough=]"
"/tmp/taskwarrior.6fbd400e77f7fc21e4829895df18191fafee0265/taskwarrior.git/src/recur2.cpp:47:13: warning: \u2018Task upgradeTask(const Task&)\u2019 defined but not used [-Wunused-function]"
"not ok 2 - quotes.t: 1436: Task created but not found with ending backslash"
"not ok 3 - quotes.t: 1436: Parser hangs with backslashes"
"not ok 20 - search.t: 1479: Verify that a description of 'one two' is searchable"
"# ERROR: CommandError on file /tmp/taskwarrior.6fbd400e77f7fc21e4829895df18191fafee0265/taskwarrior.git/test/search.t line 257 in test_description_with_spaces: 'code, out, err = self.t(\"description:one\\ two list\")':"
"not ok 5 - project.t: 1455: Test project:school) # TODO"
"not ok 7 - project.t: 1617: Verify search for multi-word project"
"# ERROR: CommandError on file /tmp/taskwarrior.6fbd400e77f7fc21e4829895df18191fafee0265/taskwarrior.git/test/project.t line 467 in test_multi_word_project: 'code, out, err = self.t(\"project:'three four' list\")':"
"not ok 2 - hyphenate.t: Verify hyphenation in the absence of white space # TODO"
"not ok 1 - feature.default.project.t: default.project is not applied to projectless tasks during sync"
"# ERROR: CommandError on file /tmp/taskwarrior.6fbd400e77f7fc21e4829895df18191fafee0265/taskwarrior.git/test/feature.default.project.t line 246 in test_default_project_sync: 'self.t1(\"sync\")':"
"not ok 21 - filter.t: filter - description contains +"
"# ERROR: CommandError on file /tmp/taskwarrior.6fbd400e77f7fc21e4829895df18191fafee0265/taskwarrior.git/test/filter.t line 673 in test_filter_plus_in_descriptions: 'code, out, err = self.t(\"all description.contains:'foobar\\\\+'\")':"
"not ok 24 - filter.t: 1630: Verify that 'due.before:9d' is correctly interpreted"
"# ERROR: CommandError on file /tmp/taskwarrior.6fbd400e77f7fc21e4829895df18191fafee0265/taskwarrior.git/test/filter.t line 979 in test_attribute_modifier_with_duration: 'code, out, err = self.t(\"due.before:9d list rc.verbose:nothing\")':"
"not ok 25 - filter.t: 1630: Verify that 'due:7d' is correctly interpreted"
"# ERROR: CommandError on file /tmp/taskwarrior.6fbd400e77f7fc21e4829895df18191fafee0265/taskwarrior.git/test/filter.t line 986 in test_attribute_no_modifier_with_duration: 'code, out, err = self.t(\"due:7d list rc.verbose:nothing\")':"
"not ok 29 - filter.t: 1915: Make sure parser handles complex and-or queries correctly (4)"
"# ERROR: CommandError on file /tmp/taskwarrior.6fbd400e77f7fc21e4829895df18191fafee0265/taskwarrior.git/test/filter.t line 1069 in test_complex_and_or_query_variant_four: 'code, out, err = self.t(\"rc.verbose:nothing 'status:pending and ( project:A or project:B )' all\")':"
"not ok 33 - filter.t: 1915: Make sure parser handles complex and-or queries correctly (3)"
"# ERROR: CommandError on file /tmp/taskwarrior.6fbd400e77f7fc21e4829895df18191fafee0265/taskwarrior.git/test/filter.t line 1062 in test_complex_and_or_query_variant_three: 'code, out, err = self.t(\"rc.verbose:nothing 'status:pending and (project:A or project:B)' all\")':"
"not ok 2 - dateformat.t: 886: Test invalid day synonym"
"not ok 7 - dependencies.t: 697: Verify that making a blocking task into a recurring task breaks dependencies # TODO"
"not ok 18 - dependencies.t: Check that an ID range can be used for deps # TODO"
"not ok 19 - dependencies.t: Check that IDs and UUIDs are both usable for deps"
"not ok 3 - bash_completion.t: no gc coming from bash completion"
"# ERROR: AssertionError:"
"not ok 4 - bash_completion.t: project: should be expanded and dependent on abbreviation minimum"
"# ERROR: AssertionError:"
"not ok 5 - bash_completion.t: project: expansion expanded after rc.abbreviation.minimum"
"# ERROR: AssertionError:"
"not ok 6 - bash_completion.t: project: fails if shorter than rc.abbreviation.minimum"
"# ERROR: AssertionError:"
"not ok 7 - bash_completion.t: project: expansion fails on non matching attribute"
"# ERROR: AssertionError:"
"not ok 1 - add.t: 1549: The token '1e ' left the lexer in a bad state."
192.65s
0.00% 0/0
0.03s
0.00% 0/0
0.29s
2019-03-03T00:43:13Z
  16d967ad Locked
  mrossinek
0.00% 0/0
0.39s
0.00% 0/0
15.02s
0.00% 0/0
1.61s
99.49% 3872/3892
W T
"/tmp/taskwarrior.16d967ad013191a69c21240bf030f8f0ad391c27/taskwarrior.git/src/Variant.cpp:1113:7: warning: this statement may fall through [-Wimplicit-fallthrough=]"
"/tmp/taskwarrior.16d967ad013191a69c21240bf030f8f0ad391c27/taskwarrior.git/src/recur2.cpp:47:13: warning: \u2018Task upgradeTask(const Task&)\u2019 defined but not used [-Wunused-function]"
"not ok 2 - quotes.t: 1436: Task created but not found with ending backslash"
"not ok 3 - quotes.t: 1436: Parser hangs with backslashes"
"not ok 20 - search.t: 1479: Verify that a description of 'one two' is searchable"
"# ERROR: CommandError on file /tmp/taskwarrior.16d967ad013191a69c21240bf030f8f0ad391c27/taskwarrior.git/test/search.t line 257 in test_description_with_spaces: 'code, out, err = self.t(\"description:one\\ two list\")':"
"not ok 5 - project.t: 1455: Test project:school) # TODO"
"not ok 7 - project.t: 1617: Verify search for multi-word project"
"# ERROR: CommandError on file /tmp/taskwarrior.16d967ad013191a69c21240bf030f8f0ad391c27/taskwarrior.git/test/project.t line 467 in test_multi_word_project: 'code, out, err = self.t(\"project:'three four' list\")':"
"not ok 2 - hyphenate.t: Verify hyphenation in the absence of white space # TODO"
"not ok 1 - feature.default.project.t: default.project is not applied to projectless tasks during sync"
"# ERROR: CommandError on file /tmp/taskwarrior.16d967ad013191a69c21240bf030f8f0ad391c27/taskwarrior.git/test/feature.default.project.t line 246 in test_default_project_sync: 'self.t1(\"sync\")':"
"not ok 21 - filter.t: filter - description contains +"
"# ERROR: CommandError on file /tmp/taskwarrior.16d967ad013191a69c21240bf030f8f0ad391c27/taskwarrior.git/test/filter.t line 673 in test_filter_plus_in_descriptions: 'code, out, err = self.t(\"all description.contains:'foobar\\\\+'\")':"
"not ok 24 - filter.t: 1630: Verify that 'due.before:9d' is correctly interpreted"
"# ERROR: CommandError on file /tmp/taskwarrior.16d967ad013191a69c21240bf030f8f0ad391c27/taskwarrior.git/test/filter.t line 979 in test_attribute_modifier_with_duration: 'code, out, err = self.t(\"due.before:9d list rc.verbose:nothing\")':"
"not ok 25 - filter.t: 1630: Verify that 'due:7d' is correctly interpreted"
"# ERROR: CommandError on file /tmp/taskwarrior.16d967ad013191a69c21240bf030f8f0ad391c27/taskwarrior.git/test/filter.t line 986 in test_attribute_no_modifier_with_duration: 'code, out, err = self.t(\"due:7d list rc.verbose:nothing\")':"
"not ok 29 - filter.t: 1915: Make sure parser handles complex and-or queries correctly (4)"
"# ERROR: CommandError on file /tmp/taskwarrior.16d967ad013191a69c21240bf030f8f0ad391c27/taskwarrior.git/test/filter.t line 1069 in test_complex_and_or_query_variant_four: 'code, out, err = self.t(\"rc.verbose:nothing 'status:pending and ( project:A or project:B )' all\")':"
"not ok 33 - filter.t: 1915: Make sure parser handles complex and-or queries correctly (3)"
"# ERROR: CommandError on file /tmp/taskwarrior.16d967ad013191a69c21240bf030f8f0ad391c27/taskwarrior.git/test/filter.t line 1062 in test_complex_and_or_query_variant_three: 'code, out, err = self.t(\"rc.verbose:nothing 'status:pending and (project:A or project:B)' all\")':"
"not ok 2 - dateformat.t: 886: Test invalid day synonym"
"not ok 7 - dependencies.t: 697: Verify that making a blocking task into a recurring task breaks dependencies # TODO"
"not ok 18 - dependencies.t: Check that an ID range can be used for deps # TODO"
"not ok 19 - dependencies.t: Check that IDs and UUIDs are both usable for deps"
"not ok 3 - bash_completion.t: no gc coming from bash completion"
"# ERROR: AssertionError:"
"not ok 4 - bash_completion.t: project: should be expanded and dependent on abbreviation minimum"
"# ERROR: AssertionError:"
"not ok 6 - bash_completion.t: project: fails if shorter than rc.abbreviation.minimum"
"# ERROR: AssertionError:"
"not ok 7 - bash_completion.t: project: expansion fails on non matching attribute"
"# ERROR: AssertionError:"
"not ok 1 - add.t: 1549: The token '1e ' left the lexer in a bad state."
183.91s
0.00% 0/0
0.05s
0.00% 0/0
0.34s
2019-03-03T00:43:13Z
  254e737e Locked
  mrossinek
0.00% 0/0
0.57s
0.00% 0/0
23.90s
0.00% 0/0
0.58s
99.46% 3871/3892
W T
"/tmp/taskwarrior.254e737e00217d7797d0290a7a9fde229415a207/taskwarrior.git/src/Variant.cpp:1113:7: warning: this statement may fall through [-Wimplicit-fallthrough=]"
"/tmp/taskwarrior.254e737e00217d7797d0290a7a9fde229415a207/taskwarrior.git/src/recur2.cpp:47:13: warning: \u2018Task upgradeTask(const Task&)\u2019 defined but not used [-Wunused-function]"
"not ok 2 - quotes.t: 1436: Task created but not found with ending backslash"
"not ok 3 - quotes.t: 1436: Parser hangs with backslashes"
"not ok 20 - search.t: 1479: Verify that a description of 'one two' is searchable"
"# ERROR: CommandError on file /tmp/taskwarrior.254e737e00217d7797d0290a7a9fde229415a207/taskwarrior.git/test/search.t line 257 in test_description_with_spaces: 'code, out, err = self.t(\"description:one\\ two list\")':"
"not ok 5 - project.t: 1455: Test project:school) # TODO"
"not ok 7 - project.t: 1617: Verify search for multi-word project"
"# ERROR: CommandError on file /tmp/taskwarrior.254e737e00217d7797d0290a7a9fde229415a207/taskwarrior.git/test/project.t line 467 in test_multi_word_project: 'code, out, err = self.t(\"project:'three four' list\")':"
"not ok 2 - hyphenate.t: Verify hyphenation in the absence of white space # TODO"
"not ok 1 - feature.default.project.t: default.project is not applied to projectless tasks during sync"
"# ERROR: CommandError on file /tmp/taskwarrior.254e737e00217d7797d0290a7a9fde229415a207/taskwarrior.git/test/feature.default.project.t line 246 in test_default_project_sync: 'self.t1(\"sync\")':"
"not ok 21 - filter.t: filter - description contains +"
"# ERROR: CommandError on file /tmp/taskwarrior.254e737e00217d7797d0290a7a9fde229415a207/taskwarrior.git/test/filter.t line 673 in test_filter_plus_in_descriptions: 'code, out, err = self.t(\"all description.contains:'foobar\\\\+'\")':"
"not ok 24 - filter.t: 1630: Verify that 'due.before:9d' is correctly interpreted"
"# ERROR: CommandError on file /tmp/taskwarrior.254e737e00217d7797d0290a7a9fde229415a207/taskwarrior.git/test/filter.t line 979 in test_attribute_modifier_with_duration: 'code, out, err = self.t(\"due.before:9d list rc.verbose:nothing\")':"
"not ok 25 - filter.t: 1630: Verify that 'due:7d' is correctly interpreted"
"# ERROR: CommandError on file /tmp/taskwarrior.254e737e00217d7797d0290a7a9fde229415a207/taskwarrior.git/test/filter.t line 986 in test_attribute_no_modifier_with_duration: 'code, out, err = self.t(\"due:7d list rc.verbose:nothing\")':"
"not ok 29 - filter.t: 1915: Make sure parser handles complex and-or queries correctly (4)"
"# ERROR: CommandError on file /tmp/taskwarrior.254e737e00217d7797d0290a7a9fde229415a207/taskwarrior.git/test/filter.t line 1069 in test_complex_and_or_query_variant_four: 'code, out, err = self.t(\"rc.verbose:nothing 'status:pending and ( project:A or project:B )' all\")':"
"not ok 33 - filter.t: 1915: Make sure parser handles complex and-or queries correctly (3)"
"# ERROR: CommandError on file /tmp/taskwarrior.254e737e00217d7797d0290a7a9fde229415a207/taskwarrior.git/test/filter.t line 1062 in test_complex_and_or_query_variant_three: 'code, out, err = self.t(\"rc.verbose:nothing 'status:pending and (project:A or project:B)' all\")':"
"not ok 2 - dateformat.t: 886: Test invalid day synonym"
"not ok 7 - dependencies.t: 697: Verify that making a blocking task into a recurring task breaks dependencies # TODO"
"not ok 18 - dependencies.t: Check that an ID range can be used for deps # TODO"
"not ok 19 - dependencies.t: Check that IDs and UUIDs are both usable for deps"
"not ok 3 - bash_completion.t: no gc coming from bash completion"
"# ERROR: AssertionError:"
"not ok 4 - bash_completion.t: project: should be expanded and dependent on abbreviation minimum"
"# ERROR: AssertionError:"
"not ok 5 - bash_completion.t: project: expansion expanded after rc.abbreviation.minimum"
"# ERROR: AssertionError:"
"not ok 6 - bash_completion.t: project: fails if shorter than rc.abbreviation.minimum"
"# ERROR: AssertionError:"
"not ok 7 - bash_completion.t: project: expansion fails on non matching attribute"
"# ERROR: AssertionError:"
"not ok 1 - add.t: 1549: The token '1e ' left the lexer in a bad state."
192.75s
0.00% 0/0
0.02s
0.00% 0/0
0.52s
2019-02-14T13:02:58Z
  f6b2a654 Locked
  Janik Rabe
0.00% 0/0
1.47s
0.00% 0/0
17.11s
0.00% 0/0
0.34s
99.46% 3871/3892
W T
"/tmp/taskwarrior.f6b2a6541c462eab1e89c3bbcb4610eca84ec295/taskwarrior.git/src/Variant.cpp:1113:7: warning: this statement may fall through [-Wimplicit-fallthrough=]"
"/tmp/taskwarrior.f6b2a6541c462eab1e89c3bbcb4610eca84ec295/taskwarrior.git/src/recur2.cpp:47:13: warning: \u2018Task upgradeTask(const Task&)\u2019 defined but not used [-Wunused-function]"
"not ok 2 - quotes.t: 1436: Task created but not found with ending backslash"
"not ok 3 - quotes.t: 1436: Parser hangs with backslashes"
"not ok 20 - search.t: 1479: Verify that a description of 'one two' is searchable"
"# ERROR: CommandError on file /tmp/taskwarrior.f6b2a6541c462eab1e89c3bbcb4610eca84ec295/taskwarrior.git/test/search.t line 257 in test_description_with_spaces: 'code, out, err = self.t(\"description:one\\ two list\")':"
"not ok 5 - project.t: 1455: Test project:school) # TODO"
"not ok 7 - project.t: 1617: Verify search for multi-word project"
"# ERROR: CommandError on file /tmp/taskwarrior.f6b2a6541c462eab1e89c3bbcb4610eca84ec295/taskwarrior.git/test/project.t line 467 in test_multi_word_project: 'code, out, err = self.t(\"project:'three four' list\")':"
"not ok 2 - hyphenate.t: Verify hyphenation in the absence of white space # TODO"
"not ok 1 - feature.default.project.t: default.project is not applied to projectless tasks during sync"
"# ERROR: CommandError on file /tmp/taskwarrior.f6b2a6541c462eab1e89c3bbcb4610eca84ec295/taskwarrior.git/test/feature.default.project.t line 246 in test_default_project_sync: 'self.t1(\"sync\")':"
"not ok 21 - filter.t: filter - description contains +"
"# ERROR: CommandError on file /tmp/taskwarrior.f6b2a6541c462eab1e89c3bbcb4610eca84ec295/taskwarrior.git/test/filter.t line 673 in test_filter_plus_in_descriptions: 'code, out, err = self.t(\"all description.contains:'foobar\\\\+'\")':"
"not ok 24 - filter.t: 1630: Verify that 'due.before:9d' is correctly interpreted"
"# ERROR: CommandError on file /tmp/taskwarrior.f6b2a6541c462eab1e89c3bbcb4610eca84ec295/taskwarrior.git/test/filter.t line 979 in test_attribute_modifier_with_duration: 'code, out, err = self.t(\"due.before:9d list rc.verbose:nothing\")':"
"not ok 25 - filter.t: 1630: Verify that 'due:7d' is correctly interpreted"
"# ERROR: CommandError on file /tmp/taskwarrior.f6b2a6541c462eab1e89c3bbcb4610eca84ec295/taskwarrior.git/test/filter.t line 986 in test_attribute_no_modifier_with_duration: 'code, out, err = self.t(\"due:7d list rc.verbose:nothing\")':"
"not ok 29 - filter.t: 1915: Make sure parser handles complex and-or queries correctly (4)"
"# ERROR: CommandError on file /tmp/taskwarrior.f6b2a6541c462eab1e89c3bbcb4610eca84ec295/taskwarrior.git/test/filter.t line 1069 in test_complex_and_or_query_variant_four: 'code, out, err = self.t(\"rc.verbose:nothing 'status:pending and ( project:A or project:B )' all\")':"
"not ok 33 - filter.t: 1915: Make sure parser handles complex and-or queries correctly (3)"
"# ERROR: CommandError on file /tmp/taskwarrior.f6b2a6541c462eab1e89c3bbcb4610eca84ec295/taskwarrior.git/test/filter.t line 1062 in test_complex_and_or_query_variant_three: 'code, out, err = self.t(\"rc.verbose:nothing 'status:pending and (project:A or project:B)' all\")':"
"not ok 2 - dateformat.t: 886: Test invalid day synonym"
"not ok 7 - dependencies.t: 697: Verify that making a blocking task into a recurring task breaks dependencies # TODO"
"not ok 18 - dependencies.t: Check that an ID range can be used for deps # TODO"
"not ok 19 - dependencies.t: Check that IDs and UUIDs are both usable for deps"
"not ok 3 - bash_completion.t: no gc coming from bash completion"
"# ERROR: AssertionError:"
"not ok 4 - bash_completion.t: project: should be expanded and dependent on abbreviation minimum"
"# ERROR: AssertionError:"
"not ok 5 - bash_completion.t: project: expansion expanded after rc.abbreviation.minimum"
"# ERROR: AssertionError:"
"not ok 6 - bash_completion.t: project: fails if shorter than rc.abbreviation.minimum"
"# ERROR: AssertionError:"
"not ok 7 - bash_completion.t: project: expansion fails on non matching attribute"
"# ERROR: AssertionError:"
"not ok 1 - add.t: 1549: The token '1e ' left the lexer in a bad state."
198.39s
0.00% 0/0
0.04s
0.00% 0/0
0.35s
2019-02-07T13:42:44Z
  e97146a4 Locked
  Paul Beckingham
0.00% 0/0
0.23s
0.00% 0/0
15.00s
0.00% 0/0
0.10s
99.72% 3881/3892
W T
"/tmp/taskwarrior.e97146a463d71c64e73450f118f5e2a5aaeb48c5/taskwarrior.git/src/Variant.cpp:1113:7: warning: this statement may fall through [-Wimplicit-fallthrough=]"
"/tmp/taskwarrior.e97146a463d71c64e73450f118f5e2a5aaeb48c5/taskwarrior.git/src/recur2.cpp:47:13: warning: \u2018Task upgradeTask(const Task&)\u2019 defined but not used [-Wunused-function]"
"not ok 20 - search.t: 1479: Verify that a description of 'one two' is searchable"
"# ERROR: CommandError on file /tmp/taskwarrior.e97146a463d71c64e73450f118f5e2a5aaeb48c5/taskwarrior.git/test/search.t line 257 in test_description_with_spaces: 'code, out, err = self.t(\"description:one\\ two list\")':"
"not ok 5 - project.t: 1455: Test project:school) # TODO"
"not ok 7 - project.t: 1617: Verify search for multi-word project"
"# ERROR: CommandError on file /tmp/taskwarrior.e97146a463d71c64e73450f118f5e2a5aaeb48c5/taskwarrior.git/test/project.t line 467 in test_multi_word_project: 'code, out, err = self.t(\"project:'three four' list\")':"
"not ok 2 - hyphenate.t: Verify hyphenation in the absence of white space # TODO"
"not ok 1 - feature.default.project.t: default.project is not applied to projectless tasks during sync"
"# ERROR: CommandError on file /tmp/taskwarrior.e97146a463d71c64e73450f118f5e2a5aaeb48c5/taskwarrior.git/test/feature.default.project.t line 246 in test_default_project_sync: 'self.t1(\"sync\")':"
"not ok 21 - filter.t: filter - description contains +"
"# ERROR: CommandError on file /tmp/taskwarrior.e97146a463d71c64e73450f118f5e2a5aaeb48c5/taskwarrior.git/test/filter.t line 673 in test_filter_plus_in_descriptions: 'code, out, err = self.t(\"all description.contains:'foobar\\\\+'\")':"
"not ok 24 - filter.t: 1630: Verify that 'due.before:9d' is correctly interpreted"
"# ERROR: CommandError on file /tmp/taskwarrior.e97146a463d71c64e73450f118f5e2a5aaeb48c5/taskwarrior.git/test/filter.t line 979 in test_attribute_modifier_with_duration: 'code, out, err = self.t(\"due.before:9d list rc.verbose:nothing\")':"
"not ok 25 - filter.t: 1630: Verify that 'due:7d' is correctly interpreted"
"# ERROR: CommandError on file /tmp/taskwarrior.e97146a463d71c64e73450f118f5e2a5aaeb48c5/taskwarrior.git/test/filter.t line 986 in test_attribute_no_modifier_with_duration: 'code, out, err = self.t(\"due:7d list rc.verbose:nothing\")':"
"not ok 29 - filter.t: 1915: Make sure parser handles complex and-or queries correctly (4)"
"# ERROR: CommandError on file /tmp/taskwarrior.e97146a463d71c64e73450f118f5e2a5aaeb48c5/taskwarrior.git/test/filter.t line 1069 in test_complex_and_or_query_variant_four: 'code, out, err = self.t(\"rc.verbose:nothing 'status:pending and ( project:A or project:B )' all\")':"
"not ok 33 - filter.t: 1915: Make sure parser handles complex and-or queries correctly (3)"
"# ERROR: CommandError on file /tmp/taskwarrior.e97146a463d71c64e73450f118f5e2a5aaeb48c5/taskwarrior.git/test/filter.t line 1062 in test_complex_and_or_query_variant_three: 'code, out, err = self.t(\"rc.verbose:nothing 'status:pending and (project:A or project:B)' all\")':"
"not ok 7 - dependencies.t: 697: Verify that making a blocking task into a recurring task breaks dependencies # TODO"
"not ok 18 - dependencies.t: Check that an ID range can be used for deps # TODO"
186.76s
0.00% 0/0
0.02s
0.00% 0/0
0.07s
2019-02-07T13:41:25Z
  7c7400b3 Locked
  taiyu
0.00% 0/0
0.10s
0.00% 0/0
14.04s
0.00% 0/0
0.29s
99.72% 3881/3892
W T
"/tmp/taskwarrior.7c7400b3679262c7f5cce20a7a6b6ac7aedd246a/taskwarrior.git/src/Variant.cpp:1113:7: warning: this statement may fall through [-Wimplicit-fallthrough=]"
"/tmp/taskwarrior.7c7400b3679262c7f5cce20a7a6b6ac7aedd246a/taskwarrior.git/src/recur2.cpp:47:13: warning: \u2018Task upgradeTask(const Task&)\u2019 defined but not used [-Wunused-function]"
"not ok 20 - search.t: 1479: Verify that a description of 'one two' is searchable"
"# ERROR: CommandError on file /tmp/taskwarrior.7c7400b3679262c7f5cce20a7a6b6ac7aedd246a/taskwarrior.git/test/search.t line 257 in test_description_with_spaces: 'code, out, err = self.t(\"description:one\\ two list\")':"
"not ok 5 - project.t: 1455: Test project:school) # TODO"
"not ok 7 - project.t: 1617: Verify search for multi-word project"
"# ERROR: CommandError on file /tmp/taskwarrior.7c7400b3679262c7f5cce20a7a6b6ac7aedd246a/taskwarrior.git/test/project.t line 467 in test_multi_word_project: 'code, out, err = self.t(\"project:'three four' list\")':"
"not ok 2 - hyphenate.t: Verify hyphenation in the absence of white space # TODO"
"not ok 1 - feature.default.project.t: default.project is not applied to projectless tasks during sync"
"# ERROR: CommandError on file /tmp/taskwarrior.7c7400b3679262c7f5cce20a7a6b6ac7aedd246a/taskwarrior.git/test/feature.default.project.t line 246 in test_default_project_sync: 'self.t1(\"sync\")':"
"not ok 21 - filter.t: filter - description contains +"
"# ERROR: CommandError on file /tmp/taskwarrior.7c7400b3679262c7f5cce20a7a6b6ac7aedd246a/taskwarrior.git/test/filter.t line 673 in test_filter_plus_in_descriptions: 'code, out, err = self.t(\"all description.contains:'foobar\\\\+'\")':"
"not ok 24 - filter.t: 1630: Verify that 'due.before:9d' is correctly interpreted"
"# ERROR: CommandError on file /tmp/taskwarrior.7c7400b3679262c7f5cce20a7a6b6ac7aedd246a/taskwarrior.git/test/filter.t line 979 in test_attribute_modifier_with_duration: 'code, out, err = self.t(\"due.before:9d list rc.verbose:nothing\")':"
"not ok 25 - filter.t: 1630: Verify that 'due:7d' is correctly interpreted"
"# ERROR: CommandError on file /tmp/taskwarrior.7c7400b3679262c7f5cce20a7a6b6ac7aedd246a/taskwarrior.git/test/filter.t line 986 in test_attribute_no_modifier_with_duration: 'code, out, err = self.t(\"due:7d list rc.verbose:nothing\")':"
"not ok 29 - filter.t: 1915: Make sure parser handles complex and-or queries correctly (4)"
"# ERROR: CommandError on file /tmp/taskwarrior.7c7400b3679262c7f5cce20a7a6b6ac7aedd246a/taskwarrior.git/test/filter.t line 1069 in test_complex_and_or_query_variant_four: 'code, out, err = self.t(\"rc.verbose:nothing 'status:pending and ( project:A or project:B )' all\")':"
"not ok 33 - filter.t: 1915: Make sure parser handles complex and-or queries correctly (3)"
"# ERROR: CommandError on file /tmp/taskwarrior.7c7400b3679262c7f5cce20a7a6b6ac7aedd246a/taskwarrior.git/test/filter.t line 1062 in test_complex_and_or_query_variant_three: 'code, out, err = self.t(\"rc.verbose:nothing 'status:pending and (project:A or project:B)' all\")':"
"not ok 7 - dependencies.t: 697: Verify that making a blocking task into a recurring task breaks dependencies # TODO"
"not ok 18 - dependencies.t: Check that an ID range can be used for deps # TODO"
185.00s
0.00% 0/0
0.02s
0.00% 0/0
0.07s
2019-02-07T13:41:25Z
  fd441bdd Locked
  taiyu
0.00% 0/0
0.19s
0.00% 0/0
13.17s
0.00% 0/0
0.26s
99.69% 3880/3892
W T
"/tmp/taskwarrior.fd441bdd626cc4269e7c42fc719b55d8027fdcb1/taskwarrior.git/src/Variant.cpp:1113:7: warning: this statement may fall through [-Wimplicit-fallthrough=]"
"/tmp/taskwarrior.fd441bdd626cc4269e7c42fc719b55d8027fdcb1/taskwarrior.git/src/recur2.cpp:47:13: warning: \u2018Task upgradeTask(const Task&)\u2019 defined but not used [-Wunused-function]"
"not ok 3 - verbose.t: Verbosity header"
"not ok 20 - search.t: 1479: Verify that a description of 'one two' is searchable"
"# ERROR: CommandError on file /tmp/taskwarrior.fd441bdd626cc4269e7c42fc719b55d8027fdcb1/taskwarrior.git/test/search.t line 257 in test_description_with_spaces: 'code, out, err = self.t(\"description:one\\ two list\")':"
"not ok 5 - project.t: 1455: Test project:school) # TODO"
"not ok 7 - project.t: 1617: Verify search for multi-word project"
"# ERROR: CommandError on file /tmp/taskwarrior.fd441bdd626cc4269e7c42fc719b55d8027fdcb1/taskwarrior.git/test/project.t line 467 in test_multi_word_project: 'code, out, err = self.t(\"project:'three four' list\")':"
"not ok 2 - hyphenate.t: Verify hyphenation in the absence of white space # TODO"
"not ok 1 - feature.default.project.t: default.project is not applied to projectless tasks during sync"
"# ERROR: CommandError on file /tmp/taskwarrior.fd441bdd626cc4269e7c42fc719b55d8027fdcb1/taskwarrior.git/test/feature.default.project.t line 246 in test_default_project_sync: 'self.t1(\"sync\")':"
"not ok 21 - filter.t: filter - description contains +"
"# ERROR: CommandError on file /tmp/taskwarrior.fd441bdd626cc4269e7c42fc719b55d8027fdcb1/taskwarrior.git/test/filter.t line 673 in test_filter_plus_in_descriptions: 'code, out, err = self.t(\"all description.contains:'foobar\\\\+'\")':"
"not ok 24 - filter.t: 1630: Verify that 'due.before:9d' is correctly interpreted"
"# ERROR: CommandError on file /tmp/taskwarrior.fd441bdd626cc4269e7c42fc719b55d8027fdcb1/taskwarrior.git/test/filter.t line 979 in test_attribute_modifier_with_duration: 'code, out, err = self.t(\"due.before:9d list rc.verbose:nothing\")':"
"not ok 25 - filter.t: 1630: Verify that 'due:7d' is correctly interpreted"
"# ERROR: CommandError on file /tmp/taskwarrior.fd441bdd626cc4269e7c42fc719b55d8027fdcb1/taskwarrior.git/test/filter.t line 986 in test_attribute_no_modifier_with_duration: 'code, out, err = self.t(\"due:7d list rc.verbose:nothing\")':"
"not ok 29 - filter.t: 1915: Make sure parser handles complex and-or queries correctly (4)"
"# ERROR: CommandError on file /tmp/taskwarrior.fd441bdd626cc4269e7c42fc719b55d8027fdcb1/taskwarrior.git/test/filter.t line 1069 in test_complex_and_or_query_variant_four: 'code, out, err = self.t(\"rc.verbose:nothing 'status:pending and ( project:A or project:B )' all\")':"
"not ok 33 - filter.t: 1915: Make sure parser handles complex and-or queries correctly (3)"
"# ERROR: CommandError on file /tmp/taskwarrior.fd441bdd626cc4269e7c42fc719b55d8027fdcb1/taskwarrior.git/test/filter.t line 1062 in test_complex_and_or_query_variant_three: 'code, out, err = self.t(\"rc.verbose:nothing 'status:pending and (project:A or project:B)' all\")':"
"not ok 7 - dependencies.t: 697: Verify that making a blocking task into a recurring task breaks dependencies # TODO"
"not ok 18 - dependencies.t: Check that an ID range can be used for deps # TODO"
189.28s
0.00% 0/0
0.09s
0.00% 0/0
0.20s
2019-02-07T13:41:25Z
  5150eb4b Locked
  taiyu
0.00% 0/0
0.05s
0.00% 0/0
14.39s
0.00% 0/0
0.09s
99.72% 3881/3892
W T
"/tmp/taskwarrior.5150eb4b0f11c8f78118c7aa4ea4035d58e10338/taskwarrior.git/src/Variant.cpp:1113:7: warning: this statement may fall through [-Wimplicit-fallthrough=]"
"/tmp/taskwarrior.5150eb4b0f11c8f78118c7aa4ea4035d58e10338/taskwarrior.git/src/recur2.cpp:47:13: warning: \u2018Task upgradeTask(const Task&)\u2019 defined but not used [-Wunused-function]"
"not ok 20 - search.t: 1479: Verify that a description of 'one two' is searchable"
"# ERROR: CommandError on file /tmp/taskwarrior.5150eb4b0f11c8f78118c7aa4ea4035d58e10338/taskwarrior.git/test/search.t line 257 in test_description_with_spaces: 'code, out, err = self.t(\"description:one\\ two list\")':"
"not ok 5 - project.t: 1455: Test project:school) # TODO"
"not ok 7 - project.t: 1617: Verify search for multi-word project"
"# ERROR: CommandError on file /tmp/taskwarrior.5150eb4b0f11c8f78118c7aa4ea4035d58e10338/taskwarrior.git/test/project.t line 467 in test_multi_word_project: 'code, out, err = self.t(\"project:'three four' list\")':"
"not ok 2 - hyphenate.t: Verify hyphenation in the absence of white space # TODO"
"not ok 1 - feature.default.project.t: default.project is not applied to projectless tasks during sync"
"# ERROR: CommandError on file /tmp/taskwarrior.5150eb4b0f11c8f78118c7aa4ea4035d58e10338/taskwarrior.git/test/feature.default.project.t line 246 in test_default_project_sync: 'self.t1(\"sync\")':"
"not ok 21 - filter.t: filter - description contains +"
"# ERROR: CommandError on file /tmp/taskwarrior.5150eb4b0f11c8f78118c7aa4ea4035d58e10338/taskwarrior.git/test/filter.t line 673 in test_filter_plus_in_descriptions: 'code, out, err = self.t(\"all description.contains:'foobar\\\\+'\")':"
"not ok 24 - filter.t: 1630: Verify that 'due.before:9d' is correctly interpreted"
"# ERROR: CommandError on file /tmp/taskwarrior.5150eb4b0f11c8f78118c7aa4ea4035d58e10338/taskwarrior.git/test/filter.t line 979 in test_attribute_modifier_with_duration: 'code, out, err = self.t(\"due.before:9d list rc.verbose:nothing\")':"
"not ok 25 - filter.t: 1630: Verify that 'due:7d' is correctly interpreted"
"# ERROR: CommandError on file /tmp/taskwarrior.5150eb4b0f11c8f78118c7aa4ea4035d58e10338/taskwarrior.git/test/filter.t line 986 in test_attribute_no_modifier_with_duration: 'code, out, err = self.t(\"due:7d list rc.verbose:nothing\")':"
"not ok 29 - filter.t: 1915: Make sure parser handles complex and-or queries correctly (4)"
"# ERROR: CommandError on file /tmp/taskwarrior.5150eb4b0f11c8f78118c7aa4ea4035d58e10338/taskwarrior.git/test/filter.t line 1069 in test_complex_and_or_query_variant_four: 'code, out, err = self.t(\"rc.verbose:nothing 'status:pending and ( project:A or project:B )' all\")':"
"not ok 33 - filter.t: 1915: Make sure parser handles complex and-or queries correctly (3)"
"# ERROR: CommandError on file /tmp/taskwarrior.5150eb4b0f11c8f78118c7aa4ea4035d58e10338/taskwarrior.git/test/filter.t line 1062 in test_complex_and_or_query_variant_three: 'code, out, err = self.t(\"rc.verbose:nothing 'status:pending and (project:A or project:B)' all\")':"
"not ok 7 - dependencies.t: 697: Verify that making a blocking task into a recurring task breaks dependencies # TODO"
"not ok 18 - dependencies.t: Check that an ID range can be used for deps # TODO"
182.03s
0.00% 0/0
0.05s
0.00% 0/0
0.08s
2019-02-07T13:41:25Z
  8514071f Locked
  taiyu
0.00% 0/0
0.09s
0.00% 0/0
13.94s
0.00% 0/0
0.13s
99.72% 3881/3892
W T
"/tmp/taskwarrior.8514071f19c114c26378a7f3a0fc639a26157fbb/taskwarrior.git/src/Variant.cpp:1113:7: warning: this statement may fall through [-Wimplicit-fallthrough=]"
"/tmp/taskwarrior.8514071f19c114c26378a7f3a0fc639a26157fbb/taskwarrior.git/src/recur2.cpp:47:13: warning: \u2018Task upgradeTask(const Task&)\u2019 defined but not used [-Wunused-function]"
"not ok 20 - search.t: 1479: Verify that a description of 'one two' is searchable"
"# ERROR: CommandError on file /tmp/taskwarrior.8514071f19c114c26378a7f3a0fc639a26157fbb/taskwarrior.git/test/search.t line 257 in test_description_with_spaces: 'code, out, err = self.t(\"description:one\\ two list\")':"
"not ok 5 - project.t: 1455: Test project:school) # TODO"
"not ok 7 - project.t: 1617: Verify search for multi-word project"
"# ERROR: CommandError on file /tmp/taskwarrior.8514071f19c114c26378a7f3a0fc639a26157fbb/taskwarrior.git/test/project.t line 467 in test_multi_word_project: 'code, out, err = self.t(\"project:'three four' list\")':"
"not ok 2 - hyphenate.t: Verify hyphenation in the absence of white space # TODO"
"not ok 1 - feature.default.project.t: default.project is not applied to projectless tasks during sync"
"# ERROR: CommandError on file /tmp/taskwarrior.8514071f19c114c26378a7f3a0fc639a26157fbb/taskwarrior.git/test/feature.default.project.t line 246 in test_default_project_sync: 'self.t1(\"sync\")':"
"not ok 21 - filter.t: filter - description contains +"
"# ERROR: CommandError on file /tmp/taskwarrior.8514071f19c114c26378a7f3a0fc639a26157fbb/taskwarrior.git/test/filter.t line 673 in test_filter_plus_in_descriptions: 'code, out, err = self.t(\"all description.contains:'foobar\\\\+'\")':"
"not ok 24 - filter.t: 1630: Verify that 'due.before:9d' is correctly interpreted"
"# ERROR: CommandError on file /tmp/taskwarrior.8514071f19c114c26378a7f3a0fc639a26157fbb/taskwarrior.git/test/filter.t line 979 in test_attribute_modifier_with_duration: 'code, out, err = self.t(\"due.before:9d list rc.verbose:nothing\")':"
"not ok 25 - filter.t: 1630: Verify that 'due:7d' is correctly interpreted"
"# ERROR: CommandError on file /tmp/taskwarrior.8514071f19c114c26378a7f3a0fc639a26157fbb/taskwarrior.git/test/filter.t line 986 in test_attribute_no_modifier_with_duration: 'code, out, err = self.t(\"due:7d list rc.verbose:nothing\")':"
"not ok 29 - filter.t: 1915: Make sure parser handles complex and-or queries correctly (4)"
"# ERROR: CommandError on file /tmp/taskwarrior.8514071f19c114c26378a7f3a0fc639a26157fbb/taskwarrior.git/test/filter.t line 1069 in test_complex_and_or_query_variant_four: 'code, out, err = self.t(\"rc.verbose:nothing 'status:pending and ( project:A or project:B )' all\")':"
"not ok 33 - filter.t: 1915: Make sure parser handles complex and-or queries correctly (3)"
"# ERROR: CommandError on file /tmp/taskwarrior.8514071f19c114c26378a7f3a0fc639a26157fbb/taskwarrior.git/test/filter.t line 1062 in test_complex_and_or_query_variant_three: 'code, out, err = self.t(\"rc.verbose:nothing 'status:pending and (project:A or project:B)' all\")':"
"not ok 7 - dependencies.t: 697: Verify that making a blocking task into a recurring task breaks dependencies # TODO"
"not ok 18 - dependencies.t: Check that an ID range can be used for deps # TODO"
185.60s
0.00% 0/0
0.02s
0.00% 0/0
0.09s
2019-02-07T13:41:25Z
  d2b1662a Locked
  taiyu
0.00% 0/0
0.08s
0.00% 0/0
16.37s
0.00% 0/0
0.07s
99.72% 3881/3892
W T
"/tmp/taskwarrior.d2b1662a3972d7eb7894c5b0df7d746e74dd6945/taskwarrior.git/src/Variant.cpp:1113:7: warning: this statement may fall through [-Wimplicit-fallthrough=]"
"/tmp/taskwarrior.d2b1662a3972d7eb7894c5b0df7d746e74dd6945/taskwarrior.git/src/recur2.cpp:47:13: warning: \u2018Task upgradeTask(const Task&)\u2019 defined but not used [-Wunused-function]"
"not ok 20 - search.t: 1479: Verify that a description of 'one two' is searchable"
"# ERROR: CommandError on file /tmp/taskwarrior.d2b1662a3972d7eb7894c5b0df7d746e74dd6945/taskwarrior.git/test/search.t line 257 in test_description_with_spaces: 'code, out, err = self.t(\"description:one\\ two list\")':"
"not ok 5 - project.t: 1455: Test project:school) # TODO"
"not ok 7 - project.t: 1617: Verify search for multi-word project"
"# ERROR: CommandError on file /tmp/taskwarrior.d2b1662a3972d7eb7894c5b0df7d746e74dd6945/taskwarrior.git/test/project.t line 467 in test_multi_word_project: 'code, out, err = self.t(\"project:'three four' list\")':"
"not ok 2 - hyphenate.t: Verify hyphenation in the absence of white space # TODO"
"not ok 1 - feature.default.project.t: default.project is not applied to projectless tasks during sync"
"# ERROR: CommandError on file /tmp/taskwarrior.d2b1662a3972d7eb7894c5b0df7d746e74dd6945/taskwarrior.git/test/feature.default.project.t line 246 in test_default_project_sync: 'self.t1(\"sync\")':"
"not ok 21 - filter.t: filter - description contains +"
"# ERROR: CommandError on file /tmp/taskwarrior.d2b1662a3972d7eb7894c5b0df7d746e74dd6945/taskwarrior.git/test/filter.t line 673 in test_filter_plus_in_descriptions: 'code, out, err = self.t(\"all description.contains:'foobar\\\\+'\")':"
"not ok 24 - filter.t: 1630: Verify that 'due.before:9d' is correctly interpreted"
"# ERROR: CommandError on file /tmp/taskwarrior.d2b1662a3972d7eb7894c5b0df7d746e74dd6945/taskwarrior.git/test/filter.t line 979 in test_attribute_modifier_with_duration: 'code, out, err = self.t(\"due.before:9d list rc.verbose:nothing\")':"
"not ok 25 - filter.t: 1630: Verify that 'due:7d' is correctly interpreted"
"# ERROR: CommandError on file /tmp/taskwarrior.d2b1662a3972d7eb7894c5b0df7d746e74dd6945/taskwarrior.git/test/filter.t line 986 in test_attribute_no_modifier_with_duration: 'code, out, err = self.t(\"due:7d list rc.verbose:nothing\")':"
"not ok 29 - filter.t: 1915: Make sure parser handles complex and-or queries correctly (4)"
"# ERROR: CommandError on file /tmp/taskwarrior.d2b1662a3972d7eb7894c5b0df7d746e74dd6945/taskwarrior.git/test/filter.t line 1069 in test_complex_and_or_query_variant_four: 'code, out, err = self.t(\"rc.verbose:nothing 'status:pending and ( project:A or project:B )' all\")':"
"not ok 33 - filter.t: 1915: Make sure parser handles complex and-or queries correctly (3)"
"# ERROR: CommandError on file /tmp/taskwarrior.d2b1662a3972d7eb7894c5b0df7d746e74dd6945/taskwarrior.git/test/filter.t line 1062 in test_complex_and_or_query_variant_three: 'code, out, err = self.t(\"rc.verbose:nothing 'status:pending and (project:A or project:B)' all\")':"
"not ok 7 - dependencies.t: 697: Verify that making a blocking task into a recurring task breaks dependencies # TODO"
"not ok 18 - dependencies.t: Check that an ID range can be used for deps # TODO"
192.80s
0.00% 0/0
0.04s
0.00% 0/0
0.16s
2019-02-07T13:36:07Z
  306c628c Locked
  Paul Beckingham
0.00% 0/0
0.46s
0.00% 0/0
14.57s
0.00% 0/0
0.33s
99.72% 3881/3892
W T
"/tmp/taskwarrior.306c628c34120bd42a287f29e2e5cedb13a7df8a/taskwarrior.git/src/Variant.cpp:1113:7: warning: this statement may fall through [-Wimplicit-fallthrough=]"
"/tmp/taskwarrior.306c628c34120bd42a287f29e2e5cedb13a7df8a/taskwarrior.git/src/recur2.cpp:47:13: warning: \u2018Task upgradeTask(const Task&)\u2019 defined but not used [-Wunused-function]"
"not ok 20 - search.t: 1479: Verify that a description of 'one two' is searchable"
"# ERROR: CommandError on file /tmp/taskwarrior.306c628c34120bd42a287f29e2e5cedb13a7df8a/taskwarrior.git/test/search.t line 257 in test_description_with_spaces: 'code, out, err = self.t(\"description:one\\ two list\")':"
"not ok 5 - project.t: 1455: Test project:school) # TODO"
"not ok 7 - project.t: 1617: Verify search for multi-word project"
"# ERROR: CommandError on file /tmp/taskwarrior.306c628c34120bd42a287f29e2e5cedb13a7df8a/taskwarrior.git/test/project.t line 467 in test_multi_word_project: 'code, out, err = self.t(\"project:'three four' list\")':"
"not ok 2 - hyphenate.t: Verify hyphenation in the absence of white space # TODO"
"not ok 1 - feature.default.project.t: default.project is not applied to projectless tasks during sync"
"# ERROR: CommandError on file /tmp/taskwarrior.306c628c34120bd42a287f29e2e5cedb13a7df8a/taskwarrior.git/test/feature.default.project.t line 246 in test_default_project_sync: 'self.t1(\"sync\")':"
"not ok 21 - filter.t: filter - description contains +"
"# ERROR: CommandError on file /tmp/taskwarrior.306c628c34120bd42a287f29e2e5cedb13a7df8a/taskwarrior.git/test/filter.t line 673 in test_filter_plus_in_descriptions: 'code, out, err = self.t(\"all description.contains:'foobar\\\\+'\")':"
"not ok 24 - filter.t: 1630: Verify that 'due.before:9d' is correctly interpreted"
"# ERROR: CommandError on file /tmp/taskwarrior.306c628c34120bd42a287f29e2e5cedb13a7df8a/taskwarrior.git/test/filter.t line 979 in test_attribute_modifier_with_duration: 'code, out, err = self.t(\"due.before:9d list rc.verbose:nothing\")':"
"not ok 25 - filter.t: 1630: Verify that 'due:7d' is correctly interpreted"
"# ERROR: CommandError on file /tmp/taskwarrior.306c628c34120bd42a287f29e2e5cedb13a7df8a/taskwarrior.git/test/filter.t line 986 in test_attribute_no_modifier_with_duration: 'code, out, err = self.t(\"due:7d list rc.verbose:nothing\")':"
"not ok 29 - filter.t: 1915: Make sure parser handles complex and-or queries correctly (4)"
"# ERROR: CommandError on file /tmp/taskwarrior.306c628c34120bd42a287f29e2e5cedb13a7df8a/taskwarrior.git/test/filter.t line 1069 in test_complex_and_or_query_variant_four: 'code, out, err = self.t(\"rc.verbose:nothing 'status:pending and ( project:A or project:B )' all\")':"
"not ok 33 - filter.t: 1915: Make sure parser handles complex and-or queries correctly (3)"
"# ERROR: CommandError on file /tmp/taskwarrior.306c628c34120bd42a287f29e2e5cedb13a7df8a/taskwarrior.git/test/filter.t line 1062 in test_complex_and_or_query_variant_three: 'code, out, err = self.t(\"rc.verbose:nothing 'status:pending and (project:A or project:B)' all\")':"
"not ok 7 - dependencies.t: 697: Verify that making a blocking task into a recurring task breaks dependencies # TODO"
"not ok 18 - dependencies.t: Check that an ID range can be used for deps # TODO"
194.27s
0.00% 0/0
0.02s
0.00% 0/0
0.26s
2019-02-07T13:33:09Z
  a8acff9f Locked
  Janik Rabe
0.00% 0/0
0.29s
0.00% 0/0
14.16s
0.00% 0/0
0.31s
99.72% 3881/3892
W T
"/tmp/taskwarrior.a8acff9f7f78cee0402b2f9bcfc9ef398e6c9b34/taskwarrior.git/src/Variant.cpp:1113:7: warning: this statement may fall through [-Wimplicit-fallthrough=]"
"/tmp/taskwarrior.a8acff9f7f78cee0402b2f9bcfc9ef398e6c9b34/taskwarrior.git/src/recur2.cpp:47:13: warning: \u2018Task upgradeTask(const Task&)\u2019 defined but not used [-Wunused-function]"
"not ok 20 - search.t: 1479: Verify that a description of 'one two' is searchable"
"# ERROR: CommandError on file /tmp/taskwarrior.a8acff9f7f78cee0402b2f9bcfc9ef398e6c9b34/taskwarrior.git/test/search.t line 257 in test_description_with_spaces: 'code, out, err = self.t(\"description:one\\ two list\")':"
"not ok 5 - project.t: 1455: Test project:school) # TODO"
"not ok 7 - project.t: 1617: Verify search for multi-word project"
"# ERROR: CommandError on file /tmp/taskwarrior.a8acff9f7f78cee0402b2f9bcfc9ef398e6c9b34/taskwarrior.git/test/project.t line 467 in test_multi_word_project: 'code, out, err = self.t(\"project:'three four' list\")':"
"not ok 2 - hyphenate.t: Verify hyphenation in the absence of white space # TODO"
"not ok 1 - feature.default.project.t: default.project is not applied to projectless tasks during sync"
"# ERROR: CommandError on file /tmp/taskwarrior.a8acff9f7f78cee0402b2f9bcfc9ef398e6c9b34/taskwarrior.git/test/feature.default.project.t line 246 in test_default_project_sync: 'self.t1(\"sync\")':"
"not ok 21 - filter.t: filter - description contains +"
"# ERROR: CommandError on file /tmp/taskwarrior.a8acff9f7f78cee0402b2f9bcfc9ef398e6c9b34/taskwarrior.git/test/filter.t line 673 in test_filter_plus_in_descriptions: 'code, out, err = self.t(\"all description.contains:'foobar\\\\+'\")':"
"not ok 24 - filter.t: 1630: Verify that 'due.before:9d' is correctly interpreted"
"# ERROR: CommandError on file /tmp/taskwarrior.a8acff9f7f78cee0402b2f9bcfc9ef398e6c9b34/taskwarrior.git/test/filter.t line 979 in test_attribute_modifier_with_duration: 'code, out, err = self.t(\"due.before:9d list rc.verbose:nothing\")':"
"not ok 25 - filter.t: 1630: Verify that 'due:7d' is correctly interpreted"
"# ERROR: CommandError on file /tmp/taskwarrior.a8acff9f7f78cee0402b2f9bcfc9ef398e6c9b34/taskwarrior.git/test/filter.t line 986 in test_attribute_no_modifier_with_duration: 'code, out, err = self.t(\"due:7d list rc.verbose:nothing\")':"
"not ok 29 - filter.t: 1915: Make sure parser handles complex and-or queries correctly (4)"
"# ERROR: CommandError on file /tmp/taskwarrior.a8acff9f7f78cee0402b2f9bcfc9ef398e6c9b34/taskwarrior.git/test/filter.t line 1069 in test_complex_and_or_query_variant_four: 'code, out, err = self.t(\"rc.verbose:nothing 'status:pending and ( project:A or project:B )' all\")':"
"not ok 33 - filter.t: 1915: Make sure parser handles complex and-or queries correctly (3)"
"# ERROR: CommandError on file /tmp/taskwarrior.a8acff9f7f78cee0402b2f9bcfc9ef398e6c9b34/taskwarrior.git/test/filter.t line 1062 in test_complex_and_or_query_variant_three: 'code, out, err = self.t(\"rc.verbose:nothing 'status:pending and (project:A or project:B)' all\")':"
"not ok 7 - dependencies.t: 697: Verify that making a blocking task into a recurring task breaks dependencies # TODO"
"not ok 18 - dependencies.t: Check that an ID range can be used for deps # TODO"
188.67s
0.00% 0/0
0.02s
0.00% 0/0
0.29s
2019-02-07T13:31:14Z
  16d55ed1 Locked
  Paul Beckingham
0.00% 0/0
0.36s
0.00% 0/0
14.04s
0.00% 0/0
0.25s
99.72% 3881/3892
W T
"/tmp/taskwarrior.16d55ed102872f6dcbf28ac8ed2d963b86513843/taskwarrior.git/src/Variant.cpp:1113:7: warning: this statement may fall through [-Wimplicit-fallthrough=]"
"/tmp/taskwarrior.16d55ed102872f6dcbf28ac8ed2d963b86513843/taskwarrior.git/src/recur2.cpp:47:13: warning: \u2018Task upgradeTask(const Task&)\u2019 defined but not used [-Wunused-function]"
"not ok 20 - search.t: 1479: Verify that a description of 'one two' is searchable"
"# ERROR: CommandError on file /tmp/taskwarrior.16d55ed102872f6dcbf28ac8ed2d963b86513843/taskwarrior.git/test/search.t line 257 in test_description_with_spaces: 'code, out, err = self.t(\"description:one\\ two list\")':"
"not ok 5 - project.t: 1455: Test project:school) # TODO"
"not ok 7 - project.t: 1617: Verify search for multi-word project"
"# ERROR: CommandError on file /tmp/taskwarrior.16d55ed102872f6dcbf28ac8ed2d963b86513843/taskwarrior.git/test/project.t line 467 in test_multi_word_project: 'code, out, err = self.t(\"project:'three four' list\")':"
"not ok 2 - hyphenate.t: Verify hyphenation in the absence of white space # TODO"
"not ok 1 - feature.default.project.t: default.project is not applied to projectless tasks during sync"
"# ERROR: CommandError on file /tmp/taskwarrior.16d55ed102872f6dcbf28ac8ed2d963b86513843/taskwarrior.git/test/feature.default.project.t line 246 in test_default_project_sync: 'self.t1(\"sync\")':"
"not ok 21 - filter.t: filter - description contains +"
"# ERROR: CommandError on file /tmp/taskwarrior.16d55ed102872f6dcbf28ac8ed2d963b86513843/taskwarrior.git/test/filter.t line 673 in test_filter_plus_in_descriptions: 'code, out, err = self.t(\"all description.contains:'foobar\\\\+'\")':"
"not ok 24 - filter.t: 1630: Verify that 'due.before:9d' is correctly interpreted"
"# ERROR: CommandError on file /tmp/taskwarrior.16d55ed102872f6dcbf28ac8ed2d963b86513843/taskwarrior.git/test/filter.t line 979 in test_attribute_modifier_with_duration: 'code, out, err = self.t(\"due.before:9d list rc.verbose:nothing\")':"
"not ok 25 - filter.t: 1630: Verify that 'due:7d' is correctly interpreted"
"# ERROR: CommandError on file /tmp/taskwarrior.16d55ed102872f6dcbf28ac8ed2d963b86513843/taskwarrior.git/test/filter.t line 986 in test_attribute_no_modifier_with_duration: 'code, out, err = self.t(\"due:7d list rc.verbose:nothing\")':"
"not ok 29 - filter.t: 1915: Make sure parser handles complex and-or queries correctly (4)"
"# ERROR: CommandError on file /tmp/taskwarrior.16d55ed102872f6dcbf28ac8ed2d963b86513843/taskwarrior.git/test/filter.t line 1069 in test_complex_and_or_query_variant_four: 'code, out, err = self.t(\"rc.verbose:nothing 'status:pending and ( project:A or project:B )' all\")':"
"not ok 33 - filter.t: 1915: Make sure parser handles complex and-or queries correctly (3)"
"# ERROR: CommandError on file /tmp/taskwarrior.16d55ed102872f6dcbf28ac8ed2d963b86513843/taskwarrior.git/test/filter.t line 1062 in test_complex_and_or_query_variant_three: 'code, out, err = self.t(\"rc.verbose:nothing 'status:pending and (project:A or project:B)' all\")':"
"not ok 7 - dependencies.t: 697: Verify that making a blocking task into a recurring task breaks dependencies # TODO"
"not ok 18 - dependencies.t: Check that an ID range can be used for deps # TODO"
184.38s
0.00% 0/0
0.02s
0.00% 0/0
0.24s
2019-02-07T13:20:14Z
  6a8beed7 Locked
  mrossinek
0.00% 0/0
0.12s
0.00% 0/0
13.36s
0.00% 0/0
0.11s
99.72% 3881/3892
W T
"/tmp/taskwarrior.6a8beed7f5348f1344c4fe549d9cebbf53870132/taskwarrior.git/src/Variant.cpp:1113:7: warning: this statement may fall through [-Wimplicit-fallthrough=]"
"/tmp/taskwarrior.6a8beed7f5348f1344c4fe549d9cebbf53870132/taskwarrior.git/src/recur2.cpp:47:13: warning: \u2018Task upgradeTask(const Task&)\u2019 defined but not used [-Wunused-function]"
"not ok 5 - project.t: 1455: Test project:school) # TODO"
"not ok 7 - project.t: 1617: Verify search for multi-word project"
"# ERROR: CommandError on file /tmp/taskwarrior.6a8beed7f5348f1344c4fe549d9cebbf53870132/taskwarrior.git/test/project.t line 467 in test_multi_word_project: 'code, out, err = self.t(\"project:'three four' list\")':"
"not ok 20 - search.t: 1479: Verify that a description of 'one two' is searchable"
"# ERROR: CommandError on file /tmp/taskwarrior.6a8beed7f5348f1344c4fe549d9cebbf53870132/taskwarrior.git/test/search.t line 257 in test_description_with_spaces: 'code, out, err = self.t(\"description:one\\ two list\")':"
"not ok 2 - hyphenate.t: Verify hyphenation in the absence of white space # TODO"
"not ok 1 - feature.default.project.t: default.project is not applied to projectless tasks during sync"
"# ERROR: CommandError on file /tmp/taskwarrior.6a8beed7f5348f1344c4fe549d9cebbf53870132/taskwarrior.git/test/feature.default.project.t line 246 in test_default_project_sync: 'self.t1(\"sync\")':"
"not ok 21 - filter.t: filter - description contains +"
"# ERROR: CommandError on file /tmp/taskwarrior.6a8beed7f5348f1344c4fe549d9cebbf53870132/taskwarrior.git/test/filter.t line 673 in test_filter_plus_in_descriptions: 'code, out, err = self.t(\"all description.contains:'foobar\\\\+'\")':"
"not ok 24 - filter.t: 1630: Verify that 'due.before:9d' is correctly interpreted"
"# ERROR: CommandError on file /tmp/taskwarrior.6a8beed7f5348f1344c4fe549d9cebbf53870132/taskwarrior.git/test/filter.t line 979 in test_attribute_modifier_with_duration: 'code, out, err = self.t(\"due.before:9d list rc.verbose:nothing\")':"
"not ok 25 - filter.t: 1630: Verify that 'due:7d' is correctly interpreted"
"# ERROR: CommandError on file /tmp/taskwarrior.6a8beed7f5348f1344c4fe549d9cebbf53870132/taskwarrior.git/test/filter.t line 986 in test_attribute_no_modifier_with_duration: 'code, out, err = self.t(\"due:7d list rc.verbose:nothing\")':"
"not ok 29 - filter.t: 1915: Make sure parser handles complex and-or queries correctly (4)"
"# ERROR: CommandError on file /tmp/taskwarrior.6a8beed7f5348f1344c4fe549d9cebbf53870132/taskwarrior.git/test/filter.t line 1069 in test_complex_and_or_query_variant_four: 'code, out, err = self.t(\"rc.verbose:nothing 'status:pending and ( project:A or project:B )' all\")':"
"not ok 33 - filter.t: 1915: Make sure parser handles complex and-or queries correctly (3)"
"# ERROR: CommandError on file /tmp/taskwarrior.6a8beed7f5348f1344c4fe549d9cebbf53870132/taskwarrior.git/test/filter.t line 1062 in test_complex_and_or_query_variant_three: 'code, out, err = self.t(\"rc.verbose:nothing 'status:pending and (project:A or project:B)' all\")':"
"not ok 7 - dependencies.t: 697: Verify that making a blocking task into a recurring task breaks dependencies # TODO"
"not ok 18 - dependencies.t: Check that an ID range can be used for deps # TODO"
185.65s
0.00% 0/0
0.05s
0.00% 0/0
0.30s
2019-02-07T13:20:14Z
  28974cd7 Locked
  mrossinek
0.00% 0/0
0.35s
0.00% 0/0
17.65s
0.00% 0/0
0.59s
99.72% 3879/3890
W T
"/tmp/taskwarrior.28974cd794eb56d9406e2e1dc5d8b20fc98810e2/taskwarrior.git/src/Variant.cpp:1113:7: warning: this statement may fall through [-Wimplicit-fallthrough=]"
"/tmp/taskwarrior.28974cd794eb56d9406e2e1dc5d8b20fc98810e2/taskwarrior.git/src/recur2.cpp:47:13: warning: \u2018Task upgradeTask(const Task&)\u2019 defined but not used [-Wunused-function]"
"not ok 5 - project.t: 1455: Test project:school) # TODO"
"not ok 7 - project.t: 1617: Verify search for multi-word project"
"# ERROR: CommandError on file /tmp/taskwarrior.28974cd794eb56d9406e2e1dc5d8b20fc98810e2/taskwarrior.git/test/project.t line 467 in test_multi_word_project: 'code, out, err = self.t(\"project:'three four' list\")':"
"not ok 20 - search.t: 1479: Verify that a description of 'one two' is searchable"
"# ERROR: CommandError on file /tmp/taskwarrior.28974cd794eb56d9406e2e1dc5d8b20fc98810e2/taskwarrior.git/test/search.t line 257 in test_description_with_spaces: 'code, out, err = self.t(\"description:one\\ two list\")':"
"not ok 2 - hyphenate.t: Verify hyphenation in the absence of white space # TODO"
"not ok 1 - feature.default.project.t: default.project is not applied to projectless tasks during sync"
"# ERROR: CommandError on file /tmp/taskwarrior.28974cd794eb56d9406e2e1dc5d8b20fc98810e2/taskwarrior.git/test/feature.default.project.t line 246 in test_default_project_sync: 'self.t1(\"sync\")':"
"not ok 21 - filter.t: filter - description contains +"
"# ERROR: CommandError on file /tmp/taskwarrior.28974cd794eb56d9406e2e1dc5d8b20fc98810e2/taskwarrior.git/test/filter.t line 673 in test_filter_plus_in_descriptions: 'code, out, err = self.t(\"all description.contains:'foobar\\\\+'\")':"
"not ok 24 - filter.t: 1630: Verify that 'due.before:9d' is correctly interpreted"
"# ERROR: CommandError on file /tmp/taskwarrior.28974cd794eb56d9406e2e1dc5d8b20fc98810e2/taskwarrior.git/test/filter.t line 979 in test_attribute_modifier_with_duration: 'code, out, err = self.t(\"due.before:9d list rc.verbose:nothing\")':"
"not ok 25 - filter.t: 1630: Verify that 'due:7d' is correctly interpreted"
"# ERROR: CommandError on file /tmp/taskwarrior.28974cd794eb56d9406e2e1dc5d8b20fc98810e2/taskwarrior.git/test/filter.t line 986 in test_attribute_no_modifier_with_duration: 'code, out, err = self.t(\"due:7d list rc.verbose:nothing\")':"
"not ok 29 - filter.t: 1915: Make sure parser handles complex and-or queries correctly (4)"
"# ERROR: CommandError on file /tmp/taskwarrior.28974cd794eb56d9406e2e1dc5d8b20fc98810e2/taskwarrior.git/test/filter.t line 1069 in test_complex_and_or_query_variant_four: 'code, out, err = self.t(\"rc.verbose:nothing 'status:pending and ( project:A or project:B )' all\")':"
"not ok 33 - filter.t: 1915: Make sure parser handles complex and-or queries correctly (3)"
"# ERROR: CommandError on file /tmp/taskwarrior.28974cd794eb56d9406e2e1dc5d8b20fc98810e2/taskwarrior.git/test/filter.t line 1062 in test_complex_and_or_query_variant_three: 'code, out, err = self.t(\"rc.verbose:nothing 'status:pending and (project:A or project:B)' all\")':"
"not ok 7 - dependencies.t: 697: Verify that making a blocking task into a recurring task breaks dependencies # TODO"
"not ok 18 - dependencies.t: Check that an ID range can be used for deps # TODO"
190.51s
0.00% 0/0
0.02s
0.00% 0/0
1.40s
2019-02-07T13:20:14Z
  803f4a50 Locked
  Paul Beckingham
0.00% 0/0
0.22s
0.00% 0/0
13.81s
0.00% 0/0
0.42s
99.72% 3881/3892
W T
"/tmp/taskwarrior.803f4a5017b14dad5a23f355a3b5c22d3f406544/taskwarrior.git/src/Variant.cpp:1113:7: warning: this statement may fall through [-Wimplicit-fallthrough=]"
"/tmp/taskwarrior.803f4a5017b14dad5a23f355a3b5c22d3f406544/taskwarrior.git/src/recur2.cpp:47:13: warning: \u2018Task upgradeTask(const Task&)\u2019 defined but not used [-Wunused-function]"
"not ok 5 - project.t: 1455: Test project:school) # TODO"
"not ok 7 - project.t: 1617: Verify search for multi-word project"
"# ERROR: CommandError on file /tmp/taskwarrior.803f4a5017b14dad5a23f355a3b5c22d3f406544/taskwarrior.git/test/project.t line 467 in test_multi_word_project: 'code, out, err = self.t(\"project:'three four' list\")':"
"not ok 20 - search.t: 1479: Verify that a description of 'one two' is searchable"
"# ERROR: CommandError on file /tmp/taskwarrior.803f4a5017b14dad5a23f355a3b5c22d3f406544/taskwarrior.git/test/search.t line 257 in test_description_with_spaces: 'code, out, err = self.t(\"description:one\\ two list\")':"
"not ok 2 - hyphenate.t: Verify hyphenation in the absence of white space # TODO"
"not ok 1 - feature.default.project.t: default.project is not applied to projectless tasks during sync"
"# ERROR: CommandError on file /tmp/taskwarrior.803f4a5017b14dad5a23f355a3b5c22d3f406544/taskwarrior.git/test/feature.default.project.t line 246 in test_default_project_sync: 'self.t1(\"sync\")':"
"not ok 21 - filter.t: filter - description contains +"
"# ERROR: CommandError on file /tmp/taskwarrior.803f4a5017b14dad5a23f355a3b5c22d3f406544/taskwarrior.git/test/filter.t line 673 in test_filter_plus_in_descriptions: 'code, out, err = self.t(\"all description.contains:'foobar\\\\+'\")':"
"not ok 24 - filter.t: 1630: Verify that 'due.before:9d' is correctly interpreted"
"# ERROR: CommandError on file /tmp/taskwarrior.803f4a5017b14dad5a23f355a3b5c22d3f406544/taskwarrior.git/test/filter.t line 979 in test_attribute_modifier_with_duration: 'code, out, err = self.t(\"due.before:9d list rc.verbose:nothing\")':"
"not ok 25 - filter.t: 1630: Verify that 'due:7d' is correctly interpreted"
"# ERROR: CommandError on file /tmp/taskwarrior.803f4a5017b14dad5a23f355a3b5c22d3f406544/taskwarrior.git/test/filter.t line 986 in test_attribute_no_modifier_with_duration: 'code, out, err = self.t(\"due:7d list rc.verbose:nothing\")':"
"not ok 29 - filter.t: 1915: Make sure parser handles complex and-or queries correctly (4)"
"# ERROR: CommandError on file /tmp/taskwarrior.803f4a5017b14dad5a23f355a3b5c22d3f406544/taskwarrior.git/test/filter.t line 1069 in test_complex_and_or_query_variant_four: 'code, out, err = self.t(\"rc.verbose:nothing 'status:pending and ( project:A or project:B )' all\")':"
"not ok 33 - filter.t: 1915: Make sure parser handles complex and-or queries correctly (3)"
"# ERROR: CommandError on file /tmp/taskwarrior.803f4a5017b14dad5a23f355a3b5c22d3f406544/taskwarrior.git/test/filter.t line 1062 in test_complex_and_or_query_variant_three: 'code, out, err = self.t(\"rc.verbose:nothing 'status:pending and (project:A or project:B)' all\")':"
"not ok 7 - dependencies.t: 697: Verify that making a blocking task into a recurring task breaks dependencies # TODO"
"not ok 18 - dependencies.t: Check that an ID range can be used for deps # TODO"
182.56s
0.00% 0/0
0.05s
0.00% 0/0
0.34s
2019-02-07T13:20:14Z
  54a57e99 Locked
  mrossinek
0.00% 0/0
0.47s
0.00% 0/0
17.78s
0.00% 0/0
0.62s
99.72% 3879/3890
W T
"/tmp/taskwarrior.54a57e9954f79152b6c58da23eb389d909c002ff/taskwarrior.git/src/Variant.cpp:1113:7: warning: this statement may fall through [-Wimplicit-fallthrough=]"
"/tmp/taskwarrior.54a57e9954f79152b6c58da23eb389d909c002ff/taskwarrior.git/src/recur2.cpp:47:13: warning: \u2018Task upgradeTask(const Task&)\u2019 defined but not used [-Wunused-function]"
"not ok 5 - project.t: 1455: Test project:school) # TODO"
"not ok 7 - project.t: 1617: Verify search for multi-word project"
"# ERROR: CommandError on file /tmp/taskwarrior.54a57e9954f79152b6c58da23eb389d909c002ff/taskwarrior.git/test/project.t line 467 in test_multi_word_project: 'code, out, err = self.t(\"project:'three four' list\")':"
"not ok 20 - search.t: 1479: Verify that a description of 'one two' is searchable"
"# ERROR: CommandError on file /tmp/taskwarrior.54a57e9954f79152b6c58da23eb389d909c002ff/taskwarrior.git/test/search.t line 257 in test_description_with_spaces: 'code, out, err = self.t(\"description:one\\ two list\")':"
"not ok 2 - hyphenate.t: Verify hyphenation in the absence of white space # TODO"
"not ok 1 - feature.default.project.t: default.project is not applied to projectless tasks during sync"
"# ERROR: CommandError on file /tmp/taskwarrior.54a57e9954f79152b6c58da23eb389d909c002ff/taskwarrior.git/test/feature.default.project.t line 246 in test_default_project_sync: 'self.t1(\"sync\")':"
"not ok 21 - filter.t: filter - description contains +"
"# ERROR: CommandError on file /tmp/taskwarrior.54a57e9954f79152b6c58da23eb389d909c002ff/taskwarrior.git/test/filter.t line 673 in test_filter_plus_in_descriptions: 'code, out, err = self.t(\"all description.contains:'foobar\\\\+'\")':"
"not ok 24 - filter.t: 1630: Verify that 'due.before:9d' is correctly interpreted"
"# ERROR: CommandError on file /tmp/taskwarrior.54a57e9954f79152b6c58da23eb389d909c002ff/taskwarrior.git/test/filter.t line 979 in test_attribute_modifier_with_duration: 'code, out, err = self.t(\"due.before:9d list rc.verbose:nothing\")':"
"not ok 25 - filter.t: 1630: Verify that 'due:7d' is correctly interpreted"
"# ERROR: CommandError on file /tmp/taskwarrior.54a57e9954f79152b6c58da23eb389d909c002ff/taskwarrior.git/test/filter.t line 986 in test_attribute_no_modifier_with_duration: 'code, out, err = self.t(\"due:7d list rc.verbose:nothing\")':"
"not ok 29 - filter.t: 1915: Make sure parser handles complex and-or queries correctly (4)"
"# ERROR: CommandError on file /tmp/taskwarrior.54a57e9954f79152b6c58da23eb389d909c002ff/taskwarrior.git/test/filter.t line 1069 in test_complex_and_or_query_variant_four: 'code, out, err = self.t(\"rc.verbose:nothing 'status:pending and ( project:A or project:B )' all\")':"
"not ok 33 - filter.t: 1915: Make sure parser handles complex and-or queries correctly (3)"
"# ERROR: CommandError on file /tmp/taskwarrior.54a57e9954f79152b6c58da23eb389d909c002ff/taskwarrior.git/test/filter.t line 1062 in test_complex_and_or_query_variant_three: 'code, out, err = self.t(\"rc.verbose:nothing 'status:pending and (project:A or project:B)' all\")':"
"not ok 7 - dependencies.t: 697: Verify that making a blocking task into a recurring task breaks dependencies # TODO"
"not ok 18 - dependencies.t: Check that an ID range can be used for deps # TODO"
193.15s
0.00% 0/0
0.06s
0.00% 0/0
0.37s
2019-02-07T13:20:14Z
  7cb341ee Locked
  mrossinek
0.00% 0/0
0.34s
0.00% 0/0
13.49s
0.00% 0/0
0.19s
99.72% 3881/3892
W T
"/tmp/taskwarrior.7cb341ee05dab120092e7e2ac6b4cb05d7359f61/taskwarrior.git/src/Variant.cpp:1113:7: warning: this statement may fall through [-Wimplicit-fallthrough=]"
"/tmp/taskwarrior.7cb341ee05dab120092e7e2ac6b4cb05d7359f61/taskwarrior.git/src/recur2.cpp:47:13: warning: \u2018Task upgradeTask(const Task&)\u2019 defined but not used [-Wunused-function]"
"not ok 5 - project.t: 1455: Test project:school) # TODO"
"not ok 7 - project.t: 1617: Verify search for multi-word project"
"# ERROR: CommandError on file /tmp/taskwarrior.7cb341ee05dab120092e7e2ac6b4cb05d7359f61/taskwarrior.git/test/project.t line 467 in test_multi_word_project: 'code, out, err = self.t(\"project:'three four' list\")':"
"not ok 20 - search.t: 1479: Verify that a description of 'one two' is searchable"
"# ERROR: CommandError on file /tmp/taskwarrior.7cb341ee05dab120092e7e2ac6b4cb05d7359f61/taskwarrior.git/test/search.t line 257 in test_description_with_spaces: 'code, out, err = self.t(\"description:one\\ two list\")':"
"not ok 2 - hyphenate.t: Verify hyphenation in the absence of white space # TODO"
"not ok 1 - feature.default.project.t: default.project is not applied to projectless tasks during sync"
"# ERROR: CommandError on file /tmp/taskwarrior.7cb341ee05dab120092e7e2ac6b4cb05d7359f61/taskwarrior.git/test/feature.default.project.t line 246 in test_default_project_sync: 'self.t1(\"sync\")':"
"not ok 21 - filter.t: filter - description contains +"
"# ERROR: CommandError on file /tmp/taskwarrior.7cb341ee05dab120092e7e2ac6b4cb05d7359f61/taskwarrior.git/test/filter.t line 673 in test_filter_plus_in_descriptions: 'code, out, err = self.t(\"all description.contains:'foobar\\\\+'\")':"
"not ok 24 - filter.t: 1630: Verify that 'due.before:9d' is correctly interpreted"
"# ERROR: CommandError on file /tmp/taskwarrior.7cb341ee05dab120092e7e2ac6b4cb05d7359f61/taskwarrior.git/test/filter.t line 979 in test_attribute_modifier_with_duration: 'code, out, err = self.t(\"due.before:9d list rc.verbose:nothing\")':"
"not ok 25 - filter.t: 1630: Verify that 'due:7d' is correctly interpreted"
"# ERROR: CommandError on file /tmp/taskwarrior.7cb341ee05dab120092e7e2ac6b4cb05d7359f61/taskwarrior.git/test/filter.t line 986 in test_attribute_no_modifier_with_duration: 'code, out, err = self.t(\"due:7d list rc.verbose:nothing\")':"
"not ok 29 - filter.t: 1915: Make sure parser handles complex and-or queries correctly (4)"
"# ERROR: CommandError on file /tmp/taskwarrior.7cb341ee05dab120092e7e2ac6b4cb05d7359f61/taskwarrior.git/test/filter.t line 1069 in test_complex_and_or_query_variant_four: 'code, out, err = self.t(\"rc.verbose:nothing 'status:pending and ( project:A or project:B )' all\")':"
"not ok 33 - filter.t: 1915: Make sure parser handles complex and-or queries correctly (3)"
"# ERROR: CommandError on file /tmp/taskwarrior.7cb341ee05dab120092e7e2ac6b4cb05d7359f61/taskwarrior.git/test/filter.t line 1062 in test_complex_and_or_query_variant_three: 'code, out, err = self.t(\"rc.verbose:nothing 'status:pending and (project:A or project:B)' all\")':"
"not ok 7 - dependencies.t: 697: Verify that making a blocking task into a recurring task breaks dependencies # TODO"
"not ok 18 - dependencies.t: Check that an ID range can be used for deps # TODO"
182.46s
0.00% 0/0
0.02s
0.00% 0/0
0.37s
2019-02-07T13:20:14Z
  2e72ae50 Locked
  Paul Beckingham
0.00% 0/0
0.22s
0.00% 0/0
13.53s
0.00% 0/0
0.29s
99.72% 3881/3892
W T
"/tmp/taskwarrior.2e72ae5068d2de522fe15404f6d4c7c019f9403a/taskwarrior.git/src/Variant.cpp:1113:7: warning: this statement may fall through [-Wimplicit-fallthrough=]"
"/tmp/taskwarrior.2e72ae5068d2de522fe15404f6d4c7c019f9403a/taskwarrior.git/src/recur2.cpp:47:13: warning: \u2018Task upgradeTask(const Task&)\u2019 defined but not used [-Wunused-function]"
"not ok 20 - search.t: 1479: Verify that a description of 'one two' is searchable"
"# ERROR: CommandError on file /tmp/taskwarrior.2e72ae5068d2de522fe15404f6d4c7c019f9403a/taskwarrior.git/test/search.t line 257 in test_description_with_spaces: 'code, out, err = self.t(\"description:one\\ two list\")':"
"not ok 5 - project.t: 1455: Test project:school) # TODO"
"not ok 7 - project.t: 1617: Verify search for multi-word project"
"# ERROR: CommandError on file /tmp/taskwarrior.2e72ae5068d2de522fe15404f6d4c7c019f9403a/taskwarrior.git/test/project.t line 467 in test_multi_word_project: 'code, out, err = self.t(\"project:'three four' list\")':"
"not ok 2 - hyphenate.t: Verify hyphenation in the absence of white space # TODO"
"not ok 1 - feature.default.project.t: default.project is not applied to projectless tasks during sync"
"# ERROR: CommandError on file /tmp/taskwarrior.2e72ae5068d2de522fe15404f6d4c7c019f9403a/taskwarrior.git/test/feature.default.project.t line 246 in test_default_project_sync: 'self.t1(\"sync\")':"
"not ok 21 - filter.t: filter - description contains +"
"# ERROR: CommandError on file /tmp/taskwarrior.2e72ae5068d2de522fe15404f6d4c7c019f9403a/taskwarrior.git/test/filter.t line 673 in test_filter_plus_in_descriptions: 'code, out, err = self.t(\"all description.contains:'foobar\\\\+'\")':"
"not ok 24 - filter.t: 1630: Verify that 'due.before:9d' is correctly interpreted"
"# ERROR: CommandError on file /tmp/taskwarrior.2e72ae5068d2de522fe15404f6d4c7c019f9403a/taskwarrior.git/test/filter.t line 979 in test_attribute_modifier_with_duration: 'code, out, err = self.t(\"due.before:9d list rc.verbose:nothing\")':"
"not ok 25 - filter.t: 1630: Verify that 'due:7d' is correctly interpreted"
"# ERROR: CommandError on file /tmp/taskwarrior.2e72ae5068d2de522fe15404f6d4c7c019f9403a/taskwarrior.git/test/filter.t line 986 in test_attribute_no_modifier_with_duration: 'code, out, err = self.t(\"due:7d list rc.verbose:nothing\")':"
"not ok 29 - filter.t: 1915: Make sure parser handles complex and-or queries correctly (4)"
"# ERROR: CommandError on file /tmp/taskwarrior.2e72ae5068d2de522fe15404f6d4c7c019f9403a/taskwarrior.git/test/filter.t line 1069 in test_complex_and_or_query_variant_four: 'code, out, err = self.t(\"rc.verbose:nothing 'status:pending and ( project:A or project:B )' all\")':"
"not ok 33 - filter.t: 1915: Make sure parser handles complex and-or queries correctly (3)"
"# ERROR: CommandError on file /tmp/taskwarrior.2e72ae5068d2de522fe15404f6d4c7c019f9403a/taskwarrior.git/test/filter.t line 1062 in test_complex_and_or_query_variant_three: 'code, out, err = self.t(\"rc.verbose:nothing 'status:pending and (project:A or project:B)' all\")':"
"not ok 7 - dependencies.t: 697: Verify that making a blocking task into a recurring task breaks dependencies # TODO"
"not ok 18 - dependencies.t: Check that an ID range can be used for deps # TODO"
183.18s
0.00% 0/0
0.02s
0.00% 0/0
0.21s
2019-02-07T13:20:14Z
  f5cd9cde Locked
  mrossinek
0.00% 0/0
0.30s
0.00% 0/0
13.79s
0.00% 0/0
0.27s
99.72% 3881/3892
W T
"/tmp/taskwarrior.f5cd9cde058a55b526bea2c945601653c7a62969/taskwarrior.git/src/Variant.cpp:1113:7: warning: this statement may fall through [-Wimplicit-fallthrough=]"
"/tmp/taskwarrior.f5cd9cde058a55b526bea2c945601653c7a62969/taskwarrior.git/src/recur2.cpp:47:13: warning: \u2018Task upgradeTask(const Task&)\u2019 defined but not used [-Wunused-function]"
"not ok 5 - project.t: 1455: Test project:school) # TODO"
"not ok 7 - project.t: 1617: Verify search for multi-word project"
"# ERROR: CommandError on file /tmp/taskwarrior.f5cd9cde058a55b526bea2c945601653c7a62969/taskwarrior.git/test/project.t line 467 in test_multi_word_project: 'code, out, err = self.t(\"project:'three four' list\")':"
"not ok 20 - search.t: 1479: Verify that a description of 'one two' is searchable"
"# ERROR: CommandError on file /tmp/taskwarrior.f5cd9cde058a55b526bea2c945601653c7a62969/taskwarrior.git/test/search.t line 257 in test_description_with_spaces: 'code, out, err = self.t(\"description:one\\ two list\")':"
"not ok 2 - hyphenate.t: Verify hyphenation in the absence of white space # TODO"
"not ok 1 - feature.default.project.t: default.project is not applied to projectless tasks during sync"
"# ERROR: CommandError on file /tmp/taskwarrior.f5cd9cde058a55b526bea2c945601653c7a62969/taskwarrior.git/test/feature.default.project.t line 246 in test_default_project_sync: 'self.t1(\"sync\")':"
"not ok 21 - filter.t: filter - description contains +"
"# ERROR: CommandError on file /tmp/taskwarrior.f5cd9cde058a55b526bea2c945601653c7a62969/taskwarrior.git/test/filter.t line 673 in test_filter_plus_in_descriptions: 'code, out, err = self.t(\"all description.contains:'foobar\\\\+'\")':"
"not ok 24 - filter.t: 1630: Verify that 'due.before:9d' is correctly interpreted"
"# ERROR: CommandError on file /tmp/taskwarrior.f5cd9cde058a55b526bea2c945601653c7a62969/taskwarrior.git/test/filter.t line 979 in test_attribute_modifier_with_duration: 'code, out, err = self.t(\"due.before:9d list rc.verbose:nothing\")':"
"not ok 25 - filter.t: 1630: Verify that 'due:7d' is correctly interpreted"
"# ERROR: CommandError on file /tmp/taskwarrior.f5cd9cde058a55b526bea2c945601653c7a62969/taskwarrior.git/test/filter.t line 986 in test_attribute_no_modifier_with_duration: 'code, out, err = self.t(\"due:7d list rc.verbose:nothing\")':"
"not ok 29 - filter.t: 1915: Make sure parser handles complex and-or queries correctly (4)"
"# ERROR: CommandError on file /tmp/taskwarrior.f5cd9cde058a55b526bea2c945601653c7a62969/taskwarrior.git/test/filter.t line 1069 in test_complex_and_or_query_variant_four: 'code, out, err = self.t(\"rc.verbose:nothing 'status:pending and ( project:A or project:B )' all\")':"
"not ok 33 - filter.t: 1915: Make sure parser handles complex and-or queries correctly (3)"
"# ERROR: CommandError on file /tmp/taskwarrior.f5cd9cde058a55b526bea2c945601653c7a62969/taskwarrior.git/test/filter.t line 1062 in test_complex_and_or_query_variant_three: 'code, out, err = self.t(\"rc.verbose:nothing 'status:pending and (project:A or project:B)' all\")':"
"not ok 7 - dependencies.t: 697: Verify that making a blocking task into a recurring task breaks dependencies # TODO"
"not ok 18 - dependencies.t: Check that an ID range can be used for deps # TODO"
182.21s
0.00% 0/0
0.05s
0.00% 0/0
0.24s
2019-02-07T13:20:14Z
  8df69597 Locked
  Paul Beckingham
0.00% 0/0
0.31s
0.00% 0/0
14.78s
0.00% 0/0
0.20s
99.72% 3881/3892
W T
"/tmp/taskwarrior.8df69597f6bdf37eb7f0addb44684f0f19712321/taskwarrior.git/src/Variant.cpp:1113:7: warning: this statement may fall through [-Wimplicit-fallthrough=]"
"/tmp/taskwarrior.8df69597f6bdf37eb7f0addb44684f0f19712321/taskwarrior.git/src/recur2.cpp:47:13: warning: \u2018Task upgradeTask(const Task&)\u2019 defined but not used [-Wunused-function]"
"not ok 5 - project.t: 1455: Test project:school) # TODO"
"not ok 7 - project.t: 1617: Verify search for multi-word project"
"# ERROR: CommandError on file /tmp/taskwarrior.8df69597f6bdf37eb7f0addb44684f0f19712321/taskwarrior.git/test/project.t line 467 in test_multi_word_project: 'code, out, err = self.t(\"project:'three four' list\")':"
"not ok 20 - search.t: 1479: Verify that a description of 'one two' is searchable"
"# ERROR: CommandError on file /tmp/taskwarrior.8df69597f6bdf37eb7f0addb44684f0f19712321/taskwarrior.git/test/search.t line 257 in test_description_with_spaces: 'code, out, err = self.t(\"description:one\\ two list\")':"
"not ok 2 - hyphenate.t: Verify hyphenation in the absence of white space # TODO"
"not ok 1 - feature.default.project.t: default.project is not applied to projectless tasks during sync"
"# ERROR: CommandError on file /tmp/taskwarrior.8df69597f6bdf37eb7f0addb44684f0f19712321/taskwarrior.git/test/feature.default.project.t line 246 in test_default_project_sync: 'self.t1(\"sync\")':"
"not ok 21 - filter.t: filter - description contains +"
"# ERROR: CommandError on file /tmp/taskwarrior.8df69597f6bdf37eb7f0addb44684f0f19712321/taskwarrior.git/test/filter.t line 673 in test_filter_plus_in_descriptions: 'code, out, err = self.t(\"all description.contains:'foobar\\\\+'\")':"
"not ok 24 - filter.t: 1630: Verify that 'due.before:9d' is correctly interpreted"
"# ERROR: CommandError on file /tmp/taskwarrior.8df69597f6bdf37eb7f0addb44684f0f19712321/taskwarrior.git/test/filter.t line 979 in test_attribute_modifier_with_duration: 'code, out, err = self.t(\"due.before:9d list rc.verbose:nothing\")':"
"not ok 25 - filter.t: 1630: Verify that 'due:7d' is correctly interpreted"
"# ERROR: CommandError on file /tmp/taskwarrior.8df69597f6bdf37eb7f0addb44684f0f19712321/taskwarrior.git/test/filter.t line 986 in test_attribute_no_modifier_with_duration: 'code, out, err = self.t(\"due:7d list rc.verbose:nothing\")':"
"not ok 29 - filter.t: 1915: Make sure parser handles complex and-or queries correctly (4)"
"# ERROR: CommandError on file /tmp/taskwarrior.8df69597f6bdf37eb7f0addb44684f0f19712321/taskwarrior.git/test/filter.t line 1069 in test_complex_and_or_query_variant_four: 'code, out, err = self.t(\"rc.verbose:nothing 'status:pending and ( project:A or project:B )' all\")':"
"not ok 33 - filter.t: 1915: Make sure parser handles complex and-or queries correctly (3)"
"# ERROR: CommandError on file /tmp/taskwarrior.8df69597f6bdf37eb7f0addb44684f0f19712321/taskwarrior.git/test/filter.t line 1062 in test_complex_and_or_query_variant_three: 'code, out, err = self.t(\"rc.verbose:nothing 'status:pending and (project:A or project:B)' all\")':"
"not ok 7 - dependencies.t: 697: Verify that making a blocking task into a recurring task breaks dependencies # TODO"
"not ok 18 - dependencies.t: Check that an ID range can be used for deps # TODO"
184.03s
0.00% 0/0
0.05s
0.00% 0/0
0.34s
2019-02-07T13:20:14Z
  9c89870c Locked
  mrossinek
0.00% 0/0
0.50s
0.00% 0/0
13.21s
0.00% 0/0
0.37s
99.72% 3881/3892
W T
"/tmp/taskwarrior.9c89870c71183c92b12eb37cfc16666bd441cf09/taskwarrior.git/src/Variant.cpp:1113:7: warning: this statement may fall through [-Wimplicit-fallthrough=]"
"/tmp/taskwarrior.9c89870c71183c92b12eb37cfc16666bd441cf09/taskwarrior.git/src/recur2.cpp:47:13: warning: \u2018Task upgradeTask(const Task&)\u2019 defined but not used [-Wunused-function]"
"not ok 5 - project.t: 1455: Test project:school) # TODO"
"not ok 7 - project.t: 1617: Verify search for multi-word project"
"# ERROR: CommandError on file /tmp/taskwarrior.9c89870c71183c92b12eb37cfc16666bd441cf09/taskwarrior.git/test/project.t line 467 in test_multi_word_project: 'code, out, err = self.t(\"project:'three four' list\")':"
"not ok 20 - search.t: 1479: Verify that a description of 'one two' is searchable"
"# ERROR: CommandError on file /tmp/taskwarrior.9c89870c71183c92b12eb37cfc16666bd441cf09/taskwarrior.git/test/search.t line 257 in test_description_with_spaces: 'code, out, err = self.t(\"description:one\\ two list\")':"
"not ok 2 - hyphenate.t: Verify hyphenation in the absence of white space # TODO"
"not ok 1 - feature.default.project.t: default.project is not applied to projectless tasks during sync"
"# ERROR: CommandError on file /tmp/taskwarrior.9c89870c71183c92b12eb37cfc16666bd441cf09/taskwarrior.git/test/feature.default.project.t line 246 in test_default_project_sync: 'self.t1(\"sync\")':"
"not ok 21 - filter.t: filter - description contains +"
"# ERROR: CommandError on file /tmp/taskwarrior.9c89870c71183c92b12eb37cfc16666bd441cf09/taskwarrior.git/test/filter.t line 673 in test_filter_plus_in_descriptions: 'code, out, err = self.t(\"all description.contains:'foobar\\\\+'\")':"
"not ok 24 - filter.t: 1630: Verify that 'due.before:9d' is correctly interpreted"
"# ERROR: CommandError on file /tmp/taskwarrior.9c89870c71183c92b12eb37cfc16666bd441cf09/taskwarrior.git/test/filter.t line 979 in test_attribute_modifier_with_duration: 'code, out, err = self.t(\"due.before:9d list rc.verbose:nothing\")':"
"not ok 25 - filter.t: 1630: Verify that 'due:7d' is correctly interpreted"
"# ERROR: CommandError on file /tmp/taskwarrior.9c89870c71183c92b12eb37cfc16666bd441cf09/taskwarrior.git/test/filter.t line 986 in test_attribute_no_modifier_with_duration: 'code, out, err = self.t(\"due:7d list rc.verbose:nothing\")':"
"not ok 29 - filter.t: 1915: Make sure parser handles complex and-or queries correctly (4)"
"# ERROR: CommandError on file /tmp/taskwarrior.9c89870c71183c92b12eb37cfc16666bd441cf09/taskwarrior.git/test/filter.t line 1069 in test_complex_and_or_query_variant_four: 'code, out, err = self.t(\"rc.verbose:nothing 'status:pending and ( project:A or project:B )' all\")':"
"not ok 33 - filter.t: 1915: Make sure parser handles complex and-or queries correctly (3)"
"# ERROR: CommandError on file /tmp/taskwarrior.9c89870c71183c92b12eb37cfc16666bd441cf09/taskwarrior.git/test/filter.t line 1062 in test_complex_and_or_query_variant_three: 'code, out, err = self.t(\"rc.verbose:nothing 'status:pending and (project:A or project:B)' all\")':"
"not ok 7 - dependencies.t: 697: Verify that making a blocking task into a recurring task breaks dependencies # TODO"
"not ok 18 - dependencies.t: Check that an ID range can be used for deps # TODO"
180.81s
0.00% 0/0
0.06s
0.00% 0/0
0.29s
2019-02-07T13:20:14Z
  b6da7759 Locked
  Paul Beckingham
0.00% 0/0
0.30s
0.00% 0/0
13.52s
0.00% 0/0
0.22s
99.72% 3881/3892
W T
"/tmp/taskwarrior.b6da775958d5c176e4a07cf02a3e511fafaf6e4e/taskwarrior.git/src/Variant.cpp:1113:7: warning: this statement may fall through [-Wimplicit-fallthrough=]"
"/tmp/taskwarrior.b6da775958d5c176e4a07cf02a3e511fafaf6e4e/taskwarrior.git/src/recur2.cpp:47:13: warning: \u2018Task upgradeTask(const Task&)\u2019 defined but not used [-Wunused-function]"
"not ok 20 - search.t: 1479: Verify that a description of 'one two' is searchable"
"# ERROR: CommandError on file /tmp/taskwarrior.b6da775958d5c176e4a07cf02a3e511fafaf6e4e/taskwarrior.git/test/search.t line 257 in test_description_with_spaces: 'code, out, err = self.t(\"description:one\\ two list\")':"
"not ok 5 - project.t: 1455: Test project:school) # TODO"
"not ok 7 - project.t: 1617: Verify search for multi-word project"
"# ERROR: CommandError on file /tmp/taskwarrior.b6da775958d5c176e4a07cf02a3e511fafaf6e4e/taskwarrior.git/test/project.t line 467 in test_multi_word_project: 'code, out, err = self.t(\"project:'three four' list\")':"
"not ok 2 - hyphenate.t: Verify hyphenation in the absence of white space # TODO"
"not ok 1 - feature.default.project.t: default.project is not applied to projectless tasks during sync"
"# ERROR: CommandError on file /tmp/taskwarrior.b6da775958d5c176e4a07cf02a3e511fafaf6e4e/taskwarrior.git/test/feature.default.project.t line 246 in test_default_project_sync: 'self.t1(\"sync\")':"
"not ok 21 - filter.t: filter - description contains +"
"# ERROR: CommandError on file /tmp/taskwarrior.b6da775958d5c176e4a07cf02a3e511fafaf6e4e/taskwarrior.git/test/filter.t line 673 in test_filter_plus_in_descriptions: 'code, out, err = self.t(\"all description.contains:'foobar\\\\+'\")':"
"not ok 24 - filter.t: 1630: Verify that 'due.before:9d' is correctly interpreted"
"# ERROR: CommandError on file /tmp/taskwarrior.b6da775958d5c176e4a07cf02a3e511fafaf6e4e/taskwarrior.git/test/filter.t line 979 in test_attribute_modifier_with_duration: 'code, out, err = self.t(\"due.before:9d list rc.verbose:nothing\")':"
"not ok 25 - filter.t: 1630: Verify that 'due:7d' is correctly interpreted"
"# ERROR: CommandError on file /tmp/taskwarrior.b6da775958d5c176e4a07cf02a3e511fafaf6e4e/taskwarrior.git/test/filter.t line 986 in test_attribute_no_modifier_with_duration: 'code, out, err = self.t(\"due:7d list rc.verbose:nothing\")':"
"not ok 29 - filter.t: 1915: Make sure parser handles complex and-or queries correctly (4)"
"# ERROR: CommandError on file /tmp/taskwarrior.b6da775958d5c176e4a07cf02a3e511fafaf6e4e/taskwarrior.git/test/filter.t line 1069 in test_complex_and_or_query_variant_four: 'code, out, err = self.t(\"rc.verbose:nothing 'status:pending and ( project:A or project:B )' all\")':"
"not ok 33 - filter.t: 1915: Make sure parser handles complex and-or queries correctly (3)"
"# ERROR: CommandError on file /tmp/taskwarrior.b6da775958d5c176e4a07cf02a3e511fafaf6e4e/taskwarrior.git/test/filter.t line 1062 in test_complex_and_or_query_variant_three: 'code, out, err = self.t(\"rc.verbose:nothing 'status:pending and (project:A or project:B)' all\")':"
"not ok 7 - dependencies.t: 697: Verify that making a blocking task into a recurring task breaks dependencies # TODO"
"not ok 18 - dependencies.t: Check that an ID range can be used for deps # TODO"
197.71s
0.00% 0/0
0.07s
0.00% 0/0
0.18s
2019-02-07T13:20:14Z
  32d14bc0 Locked
  Paul Beckingham
0.00% 0/0
0.16s
0.00% 0/0
13.51s
0.00% 0/0
0.09s
99.72% 3881/3892
W T
"/tmp/taskwarrior.32d14bc085c563ffd1ad7359758bd5909ac7e635/taskwarrior.git/src/Variant.cpp:1113:7: warning: this statement may fall through [-Wimplicit-fallthrough=]"
"/tmp/taskwarrior.32d14bc085c563ffd1ad7359758bd5909ac7e635/taskwarrior.git/src/recur2.cpp:47:13: warning: \u2018Task upgradeTask(const Task&)\u2019 defined but not used [-Wunused-function]"
"not ok 5 - project.t: 1455: Test project:school) # TODO"
"not ok 7 - project.t: 1617: Verify search for multi-word project"
"# ERROR: CommandError on file /tmp/taskwarrior.32d14bc085c563ffd1ad7359758bd5909ac7e635/taskwarrior.git/test/project.t line 467 in test_multi_word_project: 'code, out, err = self.t(\"project:'three four' list\")':"
"not ok 20 - search.t: 1479: Verify that a description of 'one two' is searchable"
"# ERROR: CommandError on file /tmp/taskwarrior.32d14bc085c563ffd1ad7359758bd5909ac7e635/taskwarrior.git/test/search.t line 257 in test_description_with_spaces: 'code, out, err = self.t(\"description:one\\ two list\")':"
"not ok 2 - hyphenate.t: Verify hyphenation in the absence of white space # TODO"
"not ok 1 - feature.default.project.t: default.project is not applied to projectless tasks during sync"
"# ERROR: CommandError on file /tmp/taskwarrior.32d14bc085c563ffd1ad7359758bd5909ac7e635/taskwarrior.git/test/feature.default.project.t line 246 in test_default_project_sync: 'self.t1(\"sync\")':"
"not ok 21 - filter.t: filter - description contains +"
"# ERROR: CommandError on file /tmp/taskwarrior.32d14bc085c563ffd1ad7359758bd5909ac7e635/taskwarrior.git/test/filter.t line 673 in test_filter_plus_in_descriptions: 'code, out, err = self.t(\"all description.contains:'foobar\\\\+'\")':"
"not ok 24 - filter.t: 1630: Verify that 'due.before:9d' is correctly interpreted"
"# ERROR: CommandError on file /tmp/taskwarrior.32d14bc085c563ffd1ad7359758bd5909ac7e635/taskwarrior.git/test/filter.t line 979 in test_attribute_modifier_with_duration: 'code, out, err = self.t(\"due.before:9d list rc.verbose:nothing\")':"
"not ok 25 - filter.t: 1630: Verify that 'due:7d' is correctly interpreted"
"# ERROR: CommandError on file /tmp/taskwarrior.32d14bc085c563ffd1ad7359758bd5909ac7e635/taskwarrior.git/test/filter.t line 986 in test_attribute_no_modifier_with_duration: 'code, out, err = self.t(\"due:7d list rc.verbose:nothing\")':"
"not ok 29 - filter.t: 1915: Make sure parser handles complex and-or queries correctly (4)"
"# ERROR: CommandError on file /tmp/taskwarrior.32d14bc085c563ffd1ad7359758bd5909ac7e635/taskwarrior.git/test/filter.t line 1069 in test_complex_and_or_query_variant_four: 'code, out, err = self.t(\"rc.verbose:nothing 'status:pending and ( project:A or project:B )' all\")':"
"not ok 33 - filter.t: 1915: Make sure parser handles complex and-or queries correctly (3)"
"# ERROR: CommandError on file /tmp/taskwarrior.32d14bc085c563ffd1ad7359758bd5909ac7e635/taskwarrior.git/test/filter.t line 1062 in test_complex_and_or_query_variant_three: 'code, out, err = self.t(\"rc.verbose:nothing 'status:pending and (project:A or project:B)' all\")':"
"not ok 7 - dependencies.t: 697: Verify that making a blocking task into a recurring task breaks dependencies # TODO"
"not ok 18 - dependencies.t: Check that an ID range can be used for deps # TODO"
178.54s
0.00% 0/0
0.02s
0.00% 0/0
0.16s
2019-02-04T11:30:23Z
  f580cc5f Locked
  Laurence
0.00% 0/0
0.51s
0.00% 0/0
14.46s
0.00% 0/0
0.41s
99.72% 3879/3890
W T
"/tmp/taskwarrior.f580cc5f6fa6cb5f9188adf873e889eb524646ef/taskwarrior.git/src/Variant.cpp:1113:7: warning: this statement may fall through [-Wimplicit-fallthrough=]"
"/tmp/taskwarrior.f580cc5f6fa6cb5f9188adf873e889eb524646ef/taskwarrior.git/src/recur2.cpp:47:13: warning: \u2018Task upgradeTask(const Task&)\u2019 defined but not used [-Wunused-function]"
"not ok 20 - search.t: 1479: Verify that a description of 'one two' is searchable"
"# ERROR: CommandError on file /tmp/taskwarrior.f580cc5f6fa6cb5f9188adf873e889eb524646ef/taskwarrior.git/test/search.t line 257 in test_description_with_spaces: 'code, out, err = self.t(\"description:one\\ two list\")':"
"not ok 5 - project.t: 1455: Test project:school) # TODO"
"not ok 7 - project.t: 1617: Verify search for multi-word project"
"# ERROR: CommandError on file /tmp/taskwarrior.f580cc5f6fa6cb5f9188adf873e889eb524646ef/taskwarrior.git/test/project.t line 467 in test_multi_word_project: 'code, out, err = self.t(\"project:'three four' list\")':"
"not ok 2 - hyphenate.t: Verify hyphenation in the absence of white space # TODO"
"not ok 1 - feature.default.project.t: default.project is not applied to projectless tasks during sync"
"# ERROR: CommandError on file /tmp/taskwarrior.f580cc5f6fa6cb5f9188adf873e889eb524646ef/taskwarrior.git/test/feature.default.project.t line 246 in test_default_project_sync: 'self.t1(\"sync\")':"
"not ok 21 - filter.t: filter - description contains +"
"# ERROR: CommandError on file /tmp/taskwarrior.f580cc5f6fa6cb5f9188adf873e889eb524646ef/taskwarrior.git/test/filter.t line 673 in test_filter_plus_in_descriptions: 'code, out, err = self.t(\"all description.contains:'foobar\\\\+'\")':"
"not ok 24 - filter.t: 1630: Verify that 'due.before:9d' is correctly interpreted"
"# ERROR: CommandError on file /tmp/taskwarrior.f580cc5f6fa6cb5f9188adf873e889eb524646ef/taskwarrior.git/test/filter.t line 979 in test_attribute_modifier_with_duration: 'code, out, err = self.t(\"due.before:9d list rc.verbose:nothing\")':"
"not ok 25 - filter.t: 1630: Verify that 'due:7d' is correctly interpreted"
"# ERROR: CommandError on file /tmp/taskwarrior.f580cc5f6fa6cb5f9188adf873e889eb524646ef/taskwarrior.git/test/filter.t line 986 in test_attribute_no_modifier_with_duration: 'code, out, err = self.t(\"due:7d list rc.verbose:nothing\")':"
"not ok 29 - filter.t: 1915: Make sure parser handles complex and-or queries correctly (4)"
"# ERROR: CommandError on file /tmp/taskwarrior.f580cc5f6fa6cb5f9188adf873e889eb524646ef/taskwarrior.git/test/filter.t line 1069 in test_complex_and_or_query_variant_four: 'code, out, err = self.t(\"rc.verbose:nothing 'status:pending and ( project:A or project:B )' all\")':"
"not ok 33 - filter.t: 1915: Make sure parser handles complex and-or queries correctly (3)"
"# ERROR: CommandError on file /tmp/taskwarrior.f580cc5f6fa6cb5f9188adf873e889eb524646ef/taskwarrior.git/test/filter.t line 1062 in test_complex_and_or_query_variant_three: 'code, out, err = self.t(\"rc.verbose:nothing 'status:pending and (project:A or project:B)' all\")':"
"not ok 7 - dependencies.t: 697: Verify that making a blocking task into a recurring task breaks dependencies # TODO"
"not ok 18 - dependencies.t: Check that an ID range can be used for deps # TODO"
189.45s
0.00% 0/0
0.02s
0.00% 0/0
0.31s
2019-02-04T11:27:30Z
  76e355c6 Locked
  mrossinek
0.00% 0/0
0.42s
0.00% 0/0
18.40s
0.00% 0/0
0.52s
99.72% 3879/3890
W T
"/tmp/taskwarrior.76e355c6027bfc6f01280d7fbe7ad2e524763810/taskwarrior.git/src/Variant.cpp:1113:7: warning: this statement may fall through [-Wimplicit-fallthrough=]"
"/tmp/taskwarrior.76e355c6027bfc6f01280d7fbe7ad2e524763810/taskwarrior.git/src/recur2.cpp:47:13: warning: \u2018Task upgradeTask(const Task&)\u2019 defined but not used [-Wunused-function]"
"not ok 20 - search.t: 1479: Verify that a description of 'one two' is searchable"
"# ERROR: CommandError on file /tmp/taskwarrior.76e355c6027bfc6f01280d7fbe7ad2e524763810/taskwarrior.git/test/search.t line 257 in test_description_with_spaces: 'code, out, err = self.t(\"description:one\\ two list\")':"
"not ok 5 - project.t: 1455: Test project:school) # TODO"
"not ok 7 - project.t: 1617: Verify search for multi-word project"
"# ERROR: CommandError on file /tmp/taskwarrior.76e355c6027bfc6f01280d7fbe7ad2e524763810/taskwarrior.git/test/project.t line 467 in test_multi_word_project: 'code, out, err = self.t(\"project:'three four' list\")':"
"not ok 2 - hyphenate.t: Verify hyphenation in the absence of white space # TODO"
"not ok 1 - feature.default.project.t: default.project is not applied to projectless tasks during sync"
"# ERROR: CommandError on file /tmp/taskwarrior.76e355c6027bfc6f01280d7fbe7ad2e524763810/taskwarrior.git/test/feature.default.project.t line 246 in test_default_project_sync: 'self.t1(\"sync\")':"
"not ok 21 - filter.t: filter - description contains +"
"# ERROR: CommandError on file /tmp/taskwarrior.76e355c6027bfc6f01280d7fbe7ad2e524763810/taskwarrior.git/test/filter.t line 673 in test_filter_plus_in_descriptions: 'code, out, err = self.t(\"all description.contains:'foobar\\\\+'\")':"
"not ok 24 - filter.t: 1630: Verify that 'due.before:9d' is correctly interpreted"
"# ERROR: CommandError on file /tmp/taskwarrior.76e355c6027bfc6f01280d7fbe7ad2e524763810/taskwarrior.git/test/filter.t line 979 in test_attribute_modifier_with_duration: 'code, out, err = self.t(\"due.before:9d list rc.verbose:nothing\")':"
"not ok 25 - filter.t: 1630: Verify that 'due:7d' is correctly interpreted"
"# ERROR: CommandError on file /tmp/taskwarrior.76e355c6027bfc6f01280d7fbe7ad2e524763810/taskwarrior.git/test/filter.t line 986 in test_attribute_no_modifier_with_duration: 'code, out, err = self.t(\"due:7d list rc.verbose:nothing\")':"
"not ok 29 - filter.t: 1915: Make sure parser handles complex and-or queries correctly (4)"
"# ERROR: CommandError on file /tmp/taskwarrior.76e355c6027bfc6f01280d7fbe7ad2e524763810/taskwarrior.git/test/filter.t line 1069 in test_complex_and_or_query_variant_four: 'code, out, err = self.t(\"rc.verbose:nothing 'status:pending and ( project:A or project:B )' all\")':"
"not ok 33 - filter.t: 1915: Make sure parser handles complex and-or queries correctly (3)"
"# ERROR: CommandError on file /tmp/taskwarrior.76e355c6027bfc6f01280d7fbe7ad2e524763810/taskwarrior.git/test/filter.t line 1062 in test_complex_and_or_query_variant_three: 'code, out, err = self.t(\"rc.verbose:nothing 'status:pending and (project:A or project:B)' all\")':"
"not ok 7 - dependencies.t: 697: Verify that making a blocking task into a recurring task breaks dependencies # TODO"
"not ok 18 - dependencies.t: Check that an ID range can be used for deps # TODO"
193.92s
0.00% 0/0
0.05s
0.00% 0/0
0.57s
2019-01-03T00:45:43Z
  5ae4ed10 Locked
  Tomas Babej
0.00% 0/0
0.32s
99.74% 3880/3890
W T
"/tmp/taskwarrior.5ae4ed1076320cd4753e70a22f96367e6fff5ad7/taskwarrior.git/src/Variant.cpp:1113:7: warning: this statement may fall through [-Wimplicit-fallthrough=]"
"/tmp/taskwarrior.5ae4ed1076320cd4753e70a22f96367e6fff5ad7/taskwarrior.git/src/recur2.cpp:47:13: warning: \u2018Task upgradeTask(const Task&)\u2019 defined but not used [-Wunused-function]"
"not ok 7 - dependencies.t: 697: Verify that making a blocking task into a recurring task breaks dependencies # TODO"
"not ok 18 - dependencies.t: Check that an ID range can be used for deps # TODO"
"not ok 2 - hyphenate.t: Verify hyphenation in the absence of white space # TODO"
"not ok 21 - filter.t: filter - description contains +"
"# ERROR: CommandError on file /tmp/taskwarrior.5ae4ed1076320cd4753e70a22f96367e6fff5ad7/taskwarrior.git/test/filter.t line 673 in test_filter_plus_in_descriptions: 'code, out, err = self.t(\"all description.contains:'foobar\\\\+'\")':"
"not ok 24 - filter.t: 1630: Verify that 'due.before:9d' is correctly interpreted"
"# ERROR: CommandError on file /tmp/taskwarrior.5ae4ed1076320cd4753e70a22f96367e6fff5ad7/taskwarrior.git/test/filter.t line 979 in test_attribute_modifier_with_duration: 'code, out, err = self.t(\"due.before:9d list rc.verbose:nothing\")':"
"not ok 25 - filter.t: 1630: Verify that 'due:7d' is correctly interpreted"
"# ERROR: CommandError on file /tmp/taskwarrior.5ae4ed1076320cd4753e70a22f96367e6fff5ad7/taskwarrior.git/test/filter.t line 986 in test_attribute_no_modifier_with_duration: 'code, out, err = self.t(\"due:7d list rc.verbose:nothing\")':"
"not ok 29 - filter.t: 1915: Make sure parser handles complex and-or queries correctly (4)"
"# ERROR: CommandError on file /tmp/taskwarrior.5ae4ed1076320cd4753e70a22f96367e6fff5ad7/taskwarrior.git/test/filter.t line 1069 in test_complex_and_or_query_variant_four: 'code, out, err = self.t(\"rc.verbose:nothing 'status:pending and ( project:A or project:B )' all\")':"
"not ok 33 - filter.t: 1915: Make sure parser handles complex and-or queries correctly (3)"
"# ERROR: CommandError on file /tmp/taskwarrior.5ae4ed1076320cd4753e70a22f96367e6fff5ad7/taskwarrior.git/test/filter.t line 1062 in test_complex_and_or_query_variant_three: 'code, out, err = self.t(\"rc.verbose:nothing 'status:pending and (project:A or project:B)' all\")':"
"not ok 5 - project.t: 1455: Test project:school) # TODO"
"not ok 7 - project.t: 1617: Verify search for multi-word project"
"# ERROR: CommandError on file /tmp/taskwarrior.5ae4ed1076320cd4753e70a22f96367e6fff5ad7/taskwarrior.git/test/project.t line 467 in test_multi_word_project: 'code, out, err = self.t(\"project:'three four' list\")':"
"not ok 20 - search.t: 1479: Verify that a description of 'one two' is searchable"
"# ERROR: CommandError on file /tmp/taskwarrior.5ae4ed1076320cd4753e70a22f96367e6fff5ad7/taskwarrior.git/test/search.t line 257 in test_description_with_spaces: 'code, out, err = self.t(\"description:one\\ two list\")':"
217.84s
0.00% 0/0
0.46s
99.72% 3879/3890
W T
"/tmp/taskwarrior.5ae4ed1076320cd4753e70a22f96367e6fff5ad7/taskwarrior.git/src/Variant.cpp:1113:7: warning: this statement may fall through [-Wimplicit-fallthrough=]"
"/tmp/taskwarrior.5ae4ed1076320cd4753e70a22f96367e6fff5ad7/taskwarrior.git/src/recur2.cpp:47:13: warning: \u2018Task upgradeTask(const Task&)\u2019 defined but not used [-Wunused-function]"
"not ok 20 - search.t: 1479: Verify that a description of 'one two' is searchable"
"# ERROR: CommandError on file /tmp/taskwarrior.5ae4ed1076320cd4753e70a22f96367e6fff5ad7/taskwarrior.git/test/search.t line 257 in test_description_with_spaces: 'code, out, err = self.t(\"description:one\\ two list\")':"
"not ok 5 - project.t: 1455: Test project:school) # TODO"
"not ok 7 - project.t: 1617: Verify search for multi-word project"
"# ERROR: CommandError on file /tmp/taskwarrior.5ae4ed1076320cd4753e70a22f96367e6fff5ad7/taskwarrior.git/test/project.t line 467 in test_multi_word_project: 'code, out, err = self.t(\"project:'three four' list\")':"
"not ok 2 - hyphenate.t: Verify hyphenation in the absence of white space # TODO"
"not ok 1 - feature.default.project.t: default.project is not applied to projectless tasks during sync"
"# ERROR: CommandError on file /tmp/taskwarrior.5ae4ed1076320cd4753e70a22f96367e6fff5ad7/taskwarrior.git/test/feature.default.project.t line 246 in test_default_project_sync: 'self.t1(\"sync\")':"
"not ok 21 - filter.t: filter - description contains +"
"# ERROR: CommandError on file /tmp/taskwarrior.5ae4ed1076320cd4753e70a22f96367e6fff5ad7/taskwarrior.git/test/filter.t line 673 in test_filter_plus_in_descriptions: 'code, out, err = self.t(\"all description.contains:'foobar\\\\+'\")':"
"not ok 24 - filter.t: 1630: Verify that 'due.before:9d' is correctly interpreted"
"# ERROR: CommandError on file /tmp/taskwarrior.5ae4ed1076320cd4753e70a22f96367e6fff5ad7/taskwarrior.git/test/filter.t line 979 in test_attribute_modifier_with_duration: 'code, out, err = self.t(\"due.before:9d list rc.verbose:nothing\")':"
"not ok 25 - filter.t: 1630: Verify that 'due:7d' is correctly interpreted"
"# ERROR: CommandError on file /tmp/taskwarrior.5ae4ed1076320cd4753e70a22f96367e6fff5ad7/taskwarrior.git/test/filter.t line 986 in test_attribute_no_modifier_with_duration: 'code, out, err = self.t(\"due:7d list rc.verbose:nothing\")':"
"not ok 29 - filter.t: 1915: Make sure parser handles complex and-or queries correctly (4)"
"# ERROR: CommandError on file /tmp/taskwarrior.5ae4ed1076320cd4753e70a22f96367e6fff5ad7/taskwarrior.git/test/filter.t line 1069 in test_complex_and_or_query_variant_four: 'code, out, err = self.t(\"rc.verbose:nothing 'status:pending and ( project:A or project:B )' all\")':"
"not ok 33 - filter.t: 1915: Make sure parser handles complex and-or queries correctly (3)"
"# ERROR: CommandError on file /tmp/taskwarrior.5ae4ed1076320cd4753e70a22f96367e6fff5ad7/taskwarrior.git/test/filter.t line 1062 in test_complex_and_or_query_variant_three: 'code, out, err = self.t(\"rc.verbose:nothing 'status:pending and (project:A or project:B)' all\")':"
"not ok 7 - dependencies.t: 697: Verify that making a blocking task into a recurring task breaks dependencies # TODO"
"not ok 18 - dependencies.t: Check that an ID range can be used for deps # TODO"
182.55s
0.00% 0/0
0.06s
0.00% 0/0
0.53s
2019-01-02T18:24:11Z
  f95d1d04 Locked
  Tomas Babej
0.00% 0/0
0.35s
99.74% 3880/3890
W T
"/tmp/taskwarrior.f95d1d0472daf12d238f5b4003e7fb40f333786d/taskwarrior.git/src/Variant.cpp:1113:7: warning: this statement may fall through [-Wimplicit-fallthrough=]"
"/tmp/taskwarrior.f95d1d0472daf12d238f5b4003e7fb40f333786d/taskwarrior.git/src/recur2.cpp:47:13: warning: \u2018Task upgradeTask(const Task&)\u2019 defined but not used [-Wunused-function]"
"not ok 7 - dependencies.t: 697: Verify that making a blocking task into a recurring task breaks dependencies # TODO"
"not ok 18 - dependencies.t: Check that an ID range can be used for deps # TODO"
"not ok 2 - hyphenate.t: Verify hyphenation in the absence of white space # TODO"
"not ok 21 - filter.t: filter - description contains +"
"# ERROR: CommandError on file /tmp/taskwarrior.f95d1d0472daf12d238f5b4003e7fb40f333786d/taskwarrior.git/test/filter.t line 673 in test_filter_plus_in_descriptions: 'code, out, err = self.t(\"all description.contains:'foobar\\\\+'\")':"
"not ok 24 - filter.t: 1630: Verify that 'due.before:9d' is correctly interpreted"
"# ERROR: CommandError on file /tmp/taskwarrior.f95d1d0472daf12d238f5b4003e7fb40f333786d/taskwarrior.git/test/filter.t line 979 in test_attribute_modifier_with_duration: 'code, out, err = self.t(\"due.before:9d list rc.verbose:nothing\")':"
"not ok 25 - filter.t: 1630: Verify that 'due:7d' is correctly interpreted"
"# ERROR: CommandError on file /tmp/taskwarrior.f95d1d0472daf12d238f5b4003e7fb40f333786d/taskwarrior.git/test/filter.t line 986 in test_attribute_no_modifier_with_duration: 'code, out, err = self.t(\"due:7d list rc.verbose:nothing\")':"
"not ok 29 - filter.t: 1915: Make sure parser handles complex and-or queries correctly (4)"
"# ERROR: CommandError on file /tmp/taskwarrior.f95d1d0472daf12d238f5b4003e7fb40f333786d/taskwarrior.git/test/filter.t line 1069 in test_complex_and_or_query_variant_four: 'code, out, err = self.t(\"rc.verbose:nothing 'status:pending and ( project:A or project:B )' all\")':"
"not ok 33 - filter.t: 1915: Make sure parser handles complex and-or queries correctly (3)"
"# ERROR: CommandError on file /tmp/taskwarrior.f95d1d0472daf12d238f5b4003e7fb40f333786d/taskwarrior.git/test/filter.t line 1062 in test_complex_and_or_query_variant_three: 'code, out, err = self.t(\"rc.verbose:nothing 'status:pending and (project:A or project:B)' all\")':"
"not ok 5 - project.t: 1455: Test project:school) # TODO"
"not ok 7 - project.t: 1617: Verify search for multi-word project"
"# ERROR: CommandError on file /tmp/taskwarrior.f95d1d0472daf12d238f5b4003e7fb40f333786d/taskwarrior.git/test/project.t line 467 in test_multi_word_project: 'code, out, err = self.t(\"project:'three four' list\")':"
"not ok 20 - search.t: 1479: Verify that a description of 'one two' is searchable"
"# ERROR: CommandError on file /tmp/taskwarrior.f95d1d0472daf12d238f5b4003e7fb40f333786d/taskwarrior.git/test/search.t line 257 in test_description_with_spaces: 'code, out, err = self.t(\"description:one\\ two list\")':"
221.97s
0.00% 0/0
0.50s
99.72% 3879/3890
W T
"/tmp/taskwarrior.f95d1d0472daf12d238f5b4003e7fb40f333786d/taskwarrior.git/src/Variant.cpp:1113:7: warning: this statement may fall through [-Wimplicit-fallthrough=]"
"/tmp/taskwarrior.f95d1d0472daf12d238f5b4003e7fb40f333786d/taskwarrior.git/src/recur2.cpp:47:13: warning: \u2018Task upgradeTask(const Task&)\u2019 defined but not used [-Wunused-function]"
"not ok 20 - search.t: 1479: Verify that a description of 'one two' is searchable"
"# ERROR: CommandError on file /tmp/taskwarrior.f95d1d0472daf12d238f5b4003e7fb40f333786d/taskwarrior.git/test/search.t line 257 in test_description_with_spaces: 'code, out, err = self.t(\"description:one\\ two list\")':"
"not ok 5 - project.t: 1455: Test project:school) # TODO"
"not ok 7 - project.t: 1617: Verify search for multi-word project"
"# ERROR: CommandError on file /tmp/taskwarrior.f95d1d0472daf12d238f5b4003e7fb40f333786d/taskwarrior.git/test/project.t line 467 in test_multi_word_project: 'code, out, err = self.t(\"project:'three four' list\")':"
"not ok 2 - hyphenate.t: Verify hyphenation in the absence of white space # TODO"
"not ok 1 - feature.default.project.t: default.project is not applied to projectless tasks during sync"
"# ERROR: CommandError on file /tmp/taskwarrior.f95d1d0472daf12d238f5b4003e7fb40f333786d/taskwarrior.git/test/feature.default.project.t line 246 in test_default_project_sync: 'self.t1(\"sync\")':"
"not ok 21 - filter.t: filter - description contains +"
"# ERROR: CommandError on file /tmp/taskwarrior.f95d1d0472daf12d238f5b4003e7fb40f333786d/taskwarrior.git/test/filter.t line 673 in test_filter_plus_in_descriptions: 'code, out, err = self.t(\"all description.contains:'foobar\\\\+'\")':"
"not ok 24 - filter.t: 1630: Verify that 'due.before:9d' is correctly interpreted"
"# ERROR: CommandError on file /tmp/taskwarrior.f95d1d0472daf12d238f5b4003e7fb40f333786d/taskwarrior.git/test/filter.t line 979 in test_attribute_modifier_with_duration: 'code, out, err = self.t(\"due.before:9d list rc.verbose:nothing\")':"
"not ok 25 - filter.t: 1630: Verify that 'due:7d' is correctly interpreted"
"# ERROR: CommandError on file /tmp/taskwarrior.f95d1d0472daf12d238f5b4003e7fb40f333786d/taskwarrior.git/test/filter.t line 986 in test_attribute_no_modifier_with_duration: 'code, out, err = self.t(\"due:7d list rc.verbose:nothing\")':"
"not ok 29 - filter.t: 1915: Make sure parser handles complex and-or queries correctly (4)"
"# ERROR: CommandError on file /tmp/taskwarrior.f95d1d0472daf12d238f5b4003e7fb40f333786d/taskwarrior.git/test/filter.t line 1069 in test_complex_and_or_query_variant_four: 'code, out, err = self.t(\"rc.verbose:nothing 'status:pending and ( project:A or project:B )' all\")':"
"not ok 33 - filter.t: 1915: Make sure parser handles complex and-or queries correctly (3)"
"# ERROR: CommandError on file /tmp/taskwarrior.f95d1d0472daf12d238f5b4003e7fb40f333786d/taskwarrior.git/test/filter.t line 1062 in test_complex_and_or_query_variant_three: 'code, out, err = self.t(\"rc.verbose:nothing 'status:pending and (project:A or project:B)' all\")':"
"not ok 7 - dependencies.t: 697: Verify that making a blocking task into a recurring task breaks dependencies # TODO"
"not ok 18 - dependencies.t: Check that an ID range can be used for deps # TODO"
181.03s
0.00% 0/0
0.03s
0.00% 0/0
0.49s
2019-01-02T18:10:18Z
  fa84dce4 Locked
  Tomas Babej
0.00% 0/0
0.55s
99.74% 3880/3890
W T
"/tmp/taskwarrior.fa84dce496fa1f258771dca08eba1c48becd2a2d/taskwarrior.git/src/Variant.cpp:1113:7: warning: this statement may fall through [-Wimplicit-fallthrough=]"
"/tmp/taskwarrior.fa84dce496fa1f258771dca08eba1c48becd2a2d/taskwarrior.git/src/recur2.cpp:47:13: warning: \u2018Task upgradeTask(const Task&)\u2019 defined but not used [-Wunused-function]"
"not ok 7 - dependencies.t: 697: Verify that making a blocking task into a recurring task breaks dependencies # TODO"
"not ok 18 - dependencies.t: Check that an ID range can be used for deps # TODO"
"not ok 2 - hyphenate.t: Verify hyphenation in the absence of white space # TODO"
"not ok 21 - filter.t: filter - description contains +"
"# ERROR: CommandError on file /tmp/taskwarrior.fa84dce496fa1f258771dca08eba1c48becd2a2d/taskwarrior.git/test/filter.t line 673 in test_filter_plus_in_descriptions: 'code, out, err = self.t(\"all description.contains:'foobar\\\\+'\")':"
"not ok 24 - filter.t: 1630: Verify that 'due.before:9d' is correctly interpreted"
"# ERROR: CommandError on file /tmp/taskwarrior.fa84dce496fa1f258771dca08eba1c48becd2a2d/taskwarrior.git/test/filter.t line 979 in test_attribute_modifier_with_duration: 'code, out, err = self.t(\"due.before:9d list rc.verbose:nothing\")':"
"not ok 25 - filter.t: 1630: Verify that 'due:7d' is correctly interpreted"
"# ERROR: CommandError on file /tmp/taskwarrior.fa84dce496fa1f258771dca08eba1c48becd2a2d/taskwarrior.git/test/filter.t line 986 in test_attribute_no_modifier_with_duration: 'code, out, err = self.t(\"due:7d list rc.verbose:nothing\")':"
"not ok 29 - filter.t: 1915: Make sure parser handles complex and-or queries correctly (4)"
"# ERROR: CommandError on file /tmp/taskwarrior.fa84dce496fa1f258771dca08eba1c48becd2a2d/taskwarrior.git/test/filter.t line 1069 in test_complex_and_or_query_variant_four: 'code, out, err = self.t(\"rc.verbose:nothing 'status:pending and ( project:A or project:B )' all\")':"
"not ok 33 - filter.t: 1915: Make sure parser handles complex and-or queries correctly (3)"
"# ERROR: CommandError on file /tmp/taskwarrior.fa84dce496fa1f258771dca08eba1c48becd2a2d/taskwarrior.git/test/filter.t line 1062 in test_complex_and_or_query_variant_three: 'code, out, err = self.t(\"rc.verbose:nothing 'status:pending and (project:A or project:B)' all\")':"
"not ok 5 - project.t: 1455: Test project:school) # TODO"
"not ok 7 - project.t: 1617: Verify search for multi-word project"
"# ERROR: CommandError on file /tmp/taskwarrior.fa84dce496fa1f258771dca08eba1c48becd2a2d/taskwarrior.git/test/project.t line 467 in test_multi_word_project: 'code, out, err = self.t(\"project:'three four' list\")':"
"not ok 20 - search.t: 1479: Verify that a description of 'one two' is searchable"
"# ERROR: CommandError on file /tmp/taskwarrior.fa84dce496fa1f258771dca08eba1c48becd2a2d/taskwarrior.git/test/search.t line 257 in test_description_with_spaces: 'code, out, err = self.t(\"description:one\\ two list\")':"
230.47s
0.00% 0/0
0.33s
99.72% 3879/3890
W T
"/tmp/taskwarrior.fa84dce496fa1f258771dca08eba1c48becd2a2d/taskwarrior.git/src/Variant.cpp:1113:7: warning: this statement may fall through [-Wimplicit-fallthrough=]"
"/tmp/taskwarrior.fa84dce496fa1f258771dca08eba1c48becd2a2d/taskwarrior.git/src/recur2.cpp:47:13: warning: \u2018Task upgradeTask(const Task&)\u2019 defined but not used [-Wunused-function]"
"not ok 20 - search.t: 1479: Verify that a description of 'one two' is searchable"
"# ERROR: CommandError on file /tmp/taskwarrior.fa84dce496fa1f258771dca08eba1c48becd2a2d/taskwarrior.git/test/search.t line 257 in test_description_with_spaces: 'code, out, err = self.t(\"description:one\\ two list\")':"
"not ok 5 - project.t: 1455: Test project:school) # TODO"
"not ok 7 - project.t: 1617: Verify search for multi-word project"
"# ERROR: CommandError on file /tmp/taskwarrior.fa84dce496fa1f258771dca08eba1c48becd2a2d/taskwarrior.git/test/project.t line 467 in test_multi_word_project: 'code, out, err = self.t(\"project:'three four' list\")':"
"not ok 2 - hyphenate.t: Verify hyphenation in the absence of white space # TODO"
"not ok 1 - feature.default.project.t: default.project is not applied to projectless tasks during sync"
"# ERROR: CommandError on file /tmp/taskwarrior.fa84dce496fa1f258771dca08eba1c48becd2a2d/taskwarrior.git/test/feature.default.project.t line 246 in test_default_project_sync: 'self.t1(\"sync\")':"
"not ok 21 - filter.t: filter - description contains +"
"# ERROR: CommandError on file /tmp/taskwarrior.fa84dce496fa1f258771dca08eba1c48becd2a2d/taskwarrior.git/test/filter.t line 673 in test_filter_plus_in_descriptions: 'code, out, err = self.t(\"all description.contains:'foobar\\\\+'\")':"
"not ok 24 - filter.t: 1630: Verify that 'due.before:9d' is correctly interpreted"
"# ERROR: CommandError on file /tmp/taskwarrior.fa84dce496fa1f258771dca08eba1c48becd2a2d/taskwarrior.git/test/filter.t line 979 in test_attribute_modifier_with_duration: 'code, out, err = self.t(\"due.before:9d list rc.verbose:nothing\")':"
"not ok 25 - filter.t: 1630: Verify that 'due:7d' is correctly interpreted"
"# ERROR: CommandError on file /tmp/taskwarrior.fa84dce496fa1f258771dca08eba1c48becd2a2d/taskwarrior.git/test/filter.t line 986 in test_attribute_no_modifier_with_duration: 'code, out, err = self.t(\"due:7d list rc.verbose:nothing\")':"
"not ok 29 - filter.t: 1915: Make sure parser handles complex and-or queries correctly (4)"
"# ERROR: CommandError on file /tmp/taskwarrior.fa84dce496fa1f258771dca08eba1c48becd2a2d/taskwarrior.git/test/filter.t line 1069 in test_complex_and_or_query_variant_four: 'code, out, err = self.t(\"rc.verbose:nothing 'status:pending and ( project:A or project:B )' all\")':"
"not ok 33 - filter.t: 1915: Make sure parser handles complex and-or queries correctly (3)"
"# ERROR: CommandError on file /tmp/taskwarrior.fa84dce496fa1f258771dca08eba1c48becd2a2d/taskwarrior.git/test/filter.t line 1062 in test_complex_and_or_query_variant_three: 'code, out, err = self.t(\"rc.verbose:nothing 'status:pending and (project:A or project:B)' all\")':"
"not ok 7 - dependencies.t: 697: Verify that making a blocking task into a recurring task breaks dependencies # TODO"
"not ok 18 - dependencies.t: Check that an ID range can be used for deps # TODO"
184.88s
0.00% 0/0
0.05s
0.00% 0/0
0.22s
2019-01-02T16:32:03Z
  517ea11c Locked
  mrossinek
0.00% 0/0
0.34s
99.74% 3880/3890
W T
"/tmp/taskwarrior.517ea11c4c8d9a2fddc62bcb1b81b9f47fd488d4/taskwarrior.git/src/Variant.cpp:1113:7: warning: this statement may fall through [-Wimplicit-fallthrough=]"
"/tmp/taskwarrior.517ea11c4c8d9a2fddc62bcb1b81b9f47fd488d4/taskwarrior.git/src/recur2.cpp:47:13: warning: \u2018Task upgradeTask(const Task&)\u2019 defined but not used [-Wunused-function]"
"not ok 7 - dependencies.t: 697: Verify that making a blocking task into a recurring task breaks dependencies # TODO"
"not ok 18 - dependencies.t: Check that an ID range can be used for deps # TODO"
"not ok 2 - hyphenate.t: Verify hyphenation in the absence of white space # TODO"
"not ok 21 - filter.t: filter - description contains +"
"# ERROR: CommandError on file /tmp/taskwarrior.517ea11c4c8d9a2fddc62bcb1b81b9f47fd488d4/taskwarrior.git/test/filter.t line 673 in test_filter_plus_in_descriptions: 'code, out, err = self.t(\"all description.contains:'foobar\\\\+'\")':"
"not ok 24 - filter.t: 1630: Verify that 'due.before:9d' is correctly interpreted"
"# ERROR: CommandError on file /tmp/taskwarrior.517ea11c4c8d9a2fddc62bcb1b81b9f47fd488d4/taskwarrior.git/test/filter.t line 979 in test_attribute_modifier_with_duration: 'code, out, err = self.t(\"due.before:9d list rc.verbose:nothing\")':"
"not ok 25 - filter.t: 1630: Verify that 'due:7d' is correctly interpreted"
"# ERROR: CommandError on file /tmp/taskwarrior.517ea11c4c8d9a2fddc62bcb1b81b9f47fd488d4/taskwarrior.git/test/filter.t line 986 in test_attribute_no_modifier_with_duration: 'code, out, err = self.t(\"due:7d list rc.verbose:nothing\")':"
"not ok 29 - filter.t: 1915: Make sure parser handles complex and-or queries correctly (4)"
"# ERROR: CommandError on file /tmp/taskwarrior.517ea11c4c8d9a2fddc62bcb1b81b9f47fd488d4/taskwarrior.git/test/filter.t line 1069 in test_complex_and_or_query_variant_four: 'code, out, err = self.t(\"rc.verbose:nothing 'status:pending and ( project:A or project:B )' all\")':"
"not ok 33 - filter.t: 1915: Make sure parser handles complex and-or queries correctly (3)"
"# ERROR: CommandError on file /tmp/taskwarrior.517ea11c4c8d9a2fddc62bcb1b81b9f47fd488d4/taskwarrior.git/test/filter.t line 1062 in test_complex_and_or_query_variant_three: 'code, out, err = self.t(\"rc.verbose:nothing 'status:pending and (project:A or project:B)' all\")':"
"not ok 5 - project.t: 1455: Test project:school) # TODO"
"not ok 7 - project.t: 1617: Verify search for multi-word project"
"# ERROR: CommandError on file /tmp/taskwarrior.517ea11c4c8d9a2fddc62bcb1b81b9f47fd488d4/taskwarrior.git/test/project.t line 467 in test_multi_word_project: 'code, out, err = self.t(\"project:'three four' list\")':"
"not ok 20 - search.t: 1479: Verify that a description of 'one two' is searchable"
"# ERROR: CommandError on file /tmp/taskwarrior.517ea11c4c8d9a2fddc62bcb1b81b9f47fd488d4/taskwarrior.git/test/search.t line 257 in test_description_with_spaces: 'code, out, err = self.t(\"description:one\\ two list\")':"
226.33s
0.00% 0/0
0.28s
99.72% 3879/3890
W T
"/tmp/taskwarrior.517ea11c4c8d9a2fddc62bcb1b81b9f47fd488d4/taskwarrior.git/src/Variant.cpp:1113:7: warning: this statement may fall through [-Wimplicit-fallthrough=]"
"/tmp/taskwarrior.517ea11c4c8d9a2fddc62bcb1b81b9f47fd488d4/taskwarrior.git/src/recur2.cpp:47:13: warning: \u2018Task upgradeTask(const Task&)\u2019 defined but not used [-Wunused-function]"
"not ok 20 - search.t: 1479: Verify that a description of 'one two' is searchable"
"# ERROR: CommandError on file /tmp/taskwarrior.517ea11c4c8d9a2fddc62bcb1b81b9f47fd488d4/taskwarrior.git/test/search.t line 257 in test_description_with_spaces: 'code, out, err = self.t(\"description:one\\ two list\")':"
"not ok 5 - project.t: 1455: Test project:school) # TODO"
"not ok 7 - project.t: 1617: Verify search for multi-word project"
"# ERROR: CommandError on file /tmp/taskwarrior.517ea11c4c8d9a2fddc62bcb1b81b9f47fd488d4/taskwarrior.git/test/project.t line 467 in test_multi_word_project: 'code, out, err = self.t(\"project:'three four' list\")':"
"not ok 2 - hyphenate.t: Verify hyphenation in the absence of white space # TODO"
"not ok 1 - feature.default.project.t: default.project is not applied to projectless tasks during sync"
"# ERROR: CommandError on file /tmp/taskwarrior.517ea11c4c8d9a2fddc62bcb1b81b9f47fd488d4/taskwarrior.git/test/feature.default.project.t line 246 in test_default_project_sync: 'self.t1(\"sync\")':"
"not ok 21 - filter.t: filter - description contains +"
"# ERROR: CommandError on file /tmp/taskwarrior.517ea11c4c8d9a2fddc62bcb1b81b9f47fd488d4/taskwarrior.git/test/filter.t line 673 in test_filter_plus_in_descriptions: 'code, out, err = self.t(\"all description.contains:'foobar\\\\+'\")':"
"not ok 24 - filter.t: 1630: Verify that 'due.before:9d' is correctly interpreted"
"# ERROR: CommandError on file /tmp/taskwarrior.517ea11c4c8d9a2fddc62bcb1b81b9f47fd488d4/taskwarrior.git/test/filter.t line 979 in test_attribute_modifier_with_duration: 'code, out, err = self.t(\"due.before:9d list rc.verbose:nothing\")':"
"not ok 25 - filter.t: 1630: Verify that 'due:7d' is correctly interpreted"
"# ERROR: CommandError on file /tmp/taskwarrior.517ea11c4c8d9a2fddc62bcb1b81b9f47fd488d4/taskwarrior.git/test/filter.t line 986 in test_attribute_no_modifier_with_duration: 'code, out, err = self.t(\"due:7d list rc.verbose:nothing\")':"
"not ok 29 - filter.t: 1915: Make sure parser handles complex and-or queries correctly (4)"
"# ERROR: CommandError on file /tmp/taskwarrior.517ea11c4c8d9a2fddc62bcb1b81b9f47fd488d4/taskwarrior.git/test/filter.t line 1069 in test_complex_and_or_query_variant_four: 'code, out, err = self.t(\"rc.verbose:nothing 'status:pending and ( project:A or project:B )' all\")':"
"not ok 33 - filter.t: 1915: Make sure parser handles complex and-or queries correctly (3)"
"# ERROR: CommandError on file /tmp/taskwarrior.517ea11c4c8d9a2fddc62bcb1b81b9f47fd488d4/taskwarrior.git/test/filter.t line 1062 in test_complex_and_or_query_variant_three: 'code, out, err = self.t(\"rc.verbose:nothing 'status:pending and (project:A or project:B)' all\")':"
"not ok 7 - dependencies.t: 697: Verify that making a blocking task into a recurring task breaks dependencies # TODO"
"not ok 18 - dependencies.t: Check that an ID range can be used for deps # TODO"
188.15s
0.00% 0/0
0.02s
0.00% 0/0
0.32s
2019-01-02T15:36:45Z
  447830dc Locked
  mrossinek
0.00% 0/0
0.41s
99.74% 3880/3890
W T
"/tmp/taskwarrior.447830dc6881197d48baa8c6fedbae7fc2cf9098/taskwarrior.git/src/Variant.cpp:1113:7: warning: this statement may fall through [-Wimplicit-fallthrough=]"
"/tmp/taskwarrior.447830dc6881197d48baa8c6fedbae7fc2cf9098/taskwarrior.git/src/recur2.cpp:47:13: warning: \u2018Task upgradeTask(const Task&)\u2019 defined but not used [-Wunused-function]"
"not ok 7 - dependencies.t: 697: Verify that making a blocking task into a recurring task breaks dependencies # TODO"
"not ok 18 - dependencies.t: Check that an ID range can be used for deps # TODO"
"not ok 2 - hyphenate.t: Verify hyphenation in the absence of white space # TODO"
"not ok 21 - filter.t: filter - description contains +"
"# ERROR: CommandError on file /tmp/taskwarrior.447830dc6881197d48baa8c6fedbae7fc2cf9098/taskwarrior.git/test/filter.t line 673 in test_filter_plus_in_descriptions: 'code, out, err = self.t(\"all description.contains:'foobar\\\\+'\")':"
"not ok 24 - filter.t: 1630: Verify that 'due.before:9d' is correctly interpreted"
"# ERROR: CommandError on file /tmp/taskwarrior.447830dc6881197d48baa8c6fedbae7fc2cf9098/taskwarrior.git/test/filter.t line 979 in test_attribute_modifier_with_duration: 'code, out, err = self.t(\"due.before:9d list rc.verbose:nothing\")':"
"not ok 25 - filter.t: 1630: Verify that 'due:7d' is correctly interpreted"
"# ERROR: CommandError on file /tmp/taskwarrior.447830dc6881197d48baa8c6fedbae7fc2cf9098/taskwarrior.git/test/filter.t line 986 in test_attribute_no_modifier_with_duration: 'code, out, err = self.t(\"due:7d list rc.verbose:nothing\")':"
"not ok 29 - filter.t: 1915: Make sure parser handles complex and-or queries correctly (4)"
"# ERROR: CommandError on file /tmp/taskwarrior.447830dc6881197d48baa8c6fedbae7fc2cf9098/taskwarrior.git/test/filter.t line 1069 in test_complex_and_or_query_variant_four: 'code, out, err = self.t(\"rc.verbose:nothing 'status:pending and ( project:A or project:B )' all\")':"
"not ok 33 - filter.t: 1915: Make sure parser handles complex and-or queries correctly (3)"
"# ERROR: CommandError on file /tmp/taskwarrior.447830dc6881197d48baa8c6fedbae7fc2cf9098/taskwarrior.git/test/filter.t line 1062 in test_complex_and_or_query_variant_three: 'code, out, err = self.t(\"rc.verbose:nothing 'status:pending and (project:A or project:B)' all\")':"
"not ok 20 - search.t: 1479: Verify that a description of 'one two' is searchable"
"# ERROR: CommandError on file /tmp/taskwarrior.447830dc6881197d48baa8c6fedbae7fc2cf9098/taskwarrior.git/test/search.t line 257 in test_description_with_spaces: 'code, out, err = self.t(\"description:one\\ two list\")':"
"not ok 5 - project.t: 1455: Test project:school)"
"# ERROR: CommandError on file /tmp/taskwarrior.447830dc6881197d48baa8c6fedbae7fc2cf9098/taskwarrior.git/test/project.t line 391 in test_project_hierarchy_filter: 'code, out, err = self.t(\"project:two) list\")':"
"not ok 7 - project.t: 1617: Verify search for multi-word project"
"# ERROR: CommandError on file /tmp/taskwarrior.447830dc6881197d48baa8c6fedbae7fc2cf9098/taskwarrior.git/test/project.t line 466 in test_multi_word_project: 'code, out, err = self.t(\"project:'three four' list\")':"
227.14s
0.00% 0/0
0.35s
99.72% 3879/3890
W T
"/tmp/taskwarrior.447830dc6881197d48baa8c6fedbae7fc2cf9098/taskwarrior.git/src/Variant.cpp:1113:7: warning: this statement may fall through [-Wimplicit-fallthrough=]"
"/tmp/taskwarrior.447830dc6881197d48baa8c6fedbae7fc2cf9098/taskwarrior.git/src/recur2.cpp:47:13: warning: \u2018Task upgradeTask(const Task&)\u2019 defined but not used [-Wunused-function]"
"not ok 5 - project.t: 1455: Test project:school)"
"# ERROR: CommandError on file /tmp/taskwarrior.447830dc6881197d48baa8c6fedbae7fc2cf9098/taskwarrior.git/test/project.t line 391 in test_project_hierarchy_filter: 'code, out, err = self.t(\"project:two) list\")':"
"not ok 7 - project.t: 1617: Verify search for multi-word project"
"# ERROR: CommandError on file /tmp/taskwarrior.447830dc6881197d48baa8c6fedbae7fc2cf9098/taskwarrior.git/test/project.t line 466 in test_multi_word_project: 'code, out, err = self.t(\"project:'three four' list\")':"
"not ok 20 - search.t: 1479: Verify that a description of 'one two' is searchable"
"# ERROR: CommandError on file /tmp/taskwarrior.447830dc6881197d48baa8c6fedbae7fc2cf9098/taskwarrior.git/test/search.t line 257 in test_description_with_spaces: 'code, out, err = self.t(\"description:one\\ two list\")':"
"not ok 2 - hyphenate.t: Verify hyphenation in the absence of white space # TODO"
"not ok 1 - feature.default.project.t: default.project is not applied to projectless tasks during sync"
"# ERROR: CommandError on file /tmp/taskwarrior.447830dc6881197d48baa8c6fedbae7fc2cf9098/taskwarrior.git/test/feature.default.project.t line 246 in test_default_project_sync: 'self.t1(\"sync\")':"
"not ok 21 - filter.t: filter - description contains +"
"# ERROR: CommandError on file /tmp/taskwarrior.447830dc6881197d48baa8c6fedbae7fc2cf9098/taskwarrior.git/test/filter.t line 673 in test_filter_plus_in_descriptions: 'code, out, err = self.t(\"all description.contains:'foobar\\\\+'\")':"
"not ok 24 - filter.t: 1630: Verify that 'due.before:9d' is correctly interpreted"
"# ERROR: CommandError on file /tmp/taskwarrior.447830dc6881197d48baa8c6fedbae7fc2cf9098/taskwarrior.git/test/filter.t line 979 in test_attribute_modifier_with_duration: 'code, out, err = self.t(\"due.before:9d list rc.verbose:nothing\")':"
"not ok 25 - filter.t: 1630: Verify that 'due:7d' is correctly interpreted"
"# ERROR: CommandError on file /tmp/taskwarrior.447830dc6881197d48baa8c6fedbae7fc2cf9098/taskwarrior.git/test/filter.t line 986 in test_attribute_no_modifier_with_duration: 'code, out, err = self.t(\"due:7d list rc.verbose:nothing\")':"
"not ok 29 - filter.t: 1915: Make sure parser handles complex and-or queries correctly (4)"
"# ERROR: CommandError on file /tmp/taskwarrior.447830dc6881197d48baa8c6fedbae7fc2cf9098/taskwarrior.git/test/filter.t line 1069 in test_complex_and_or_query_variant_four: 'code, out, err = self.t(\"rc.verbose:nothing 'status:pending and ( project:A or project:B )' all\")':"
"not ok 33 - filter.t: 1915: Make sure parser handles complex and-or queries correctly (3)"
"# ERROR: CommandError on file /tmp/taskwarrior.447830dc6881197d48baa8c6fedbae7fc2cf9098/taskwarrior.git/test/filter.t line 1062 in test_complex_and_or_query_variant_three: 'code, out, err = self.t(\"rc.verbose:nothing 'status:pending and (project:A or project:B)' all\")':"
"not ok 7 - dependencies.t: 697: Verify that making a blocking task into a recurring task breaks dependencies # TODO"
"not ok 18 - dependencies.t: Check that an ID range can be used for deps # TODO"
185.19s
0.00% 0/0
0.06s
0.00% 0/0
0.56s
2019-01-02T15:32:16Z
  fc3b336f Locked
  mrossinek
0.00% 0/0
0.53s
99.74% 3880/3890
W T
"/tmp/taskwarrior.fc3b336f1accd0b0f99f528726be62d7171003f2/taskwarrior.git/src/Variant.cpp:1113:7: warning: this statement may fall through [-Wimplicit-fallthrough=]"
"/tmp/taskwarrior.fc3b336f1accd0b0f99f528726be62d7171003f2/taskwarrior.git/src/recur2.cpp:47:13: warning: \u2018Task upgradeTask(const Task&)\u2019 defined but not used [-Wunused-function]"
"not ok 7 - dependencies.t: 697: Verify that making a blocking task into a recurring task breaks dependencies # TODO"
"not ok 18 - dependencies.t: Check that an ID range can be used for deps # TODO"
"not ok 2 - hyphenate.t: Verify hyphenation in the absence of white space # TODO"
"not ok 21 - filter.t: filter - description contains +"
"# ERROR: CommandError on file /tmp/taskwarrior.fc3b336f1accd0b0f99f528726be62d7171003f2/taskwarrior.git/test/filter.t line 673 in test_filter_plus_in_descriptions: 'code, out, err = self.t(\"all description.contains:'foobar\\\\+'\")':"
"not ok 24 - filter.t: 1630: Verify that 'due.before:9d' is correctly interpreted"
"# ERROR: CommandError on file /tmp/taskwarrior.fc3b336f1accd0b0f99f528726be62d7171003f2/taskwarrior.git/test/filter.t line 979 in test_attribute_modifier_with_duration: 'code, out, err = self.t(\"due.before:9d list rc.verbose:nothing\")':"
"not ok 25 - filter.t: 1630: Verify that 'due:7d' is correctly interpreted"
"# ERROR: CommandError on file /tmp/taskwarrior.fc3b336f1accd0b0f99f528726be62d7171003f2/taskwarrior.git/test/filter.t line 986 in test_attribute_no_modifier_with_duration: 'code, out, err = self.t(\"due:7d list rc.verbose:nothing\")':"
"not ok 29 - filter.t: 1915: Make sure parser handles complex and-or queries correctly (4)"
"# ERROR: CommandError on file /tmp/taskwarrior.fc3b336f1accd0b0f99f528726be62d7171003f2/taskwarrior.git/test/filter.t line 1069 in test_complex_and_or_query_variant_four: 'code, out, err = self.t(\"rc.verbose:nothing 'status:pending and ( project:A or project:B )' all\")':"
"not ok 33 - filter.t: 1915: Make sure parser handles complex and-or queries correctly (3)"
"# ERROR: CommandError on file /tmp/taskwarrior.fc3b336f1accd0b0f99f528726be62d7171003f2/taskwarrior.git/test/filter.t line 1062 in test_complex_and_or_query_variant_three: 'code, out, err = self.t(\"rc.verbose:nothing 'status:pending and (project:A or project:B)' all\")':"
"not ok 5 - project.t: 1455: Test project:school)"
"# ERROR: CommandError on file /tmp/taskwarrior.fc3b336f1accd0b0f99f528726be62d7171003f2/taskwarrior.git/test/project.t line 391 in test_project_hierarchy_filter: 'code, out, err = self.t(\"project:two) list\")':"
"not ok 7 - project.t: 1617: Verify search for multi-word project"
"# ERROR: CommandError on file /tmp/taskwarrior.fc3b336f1accd0b0f99f528726be62d7171003f2/taskwarrior.git/test/project.t line 466 in test_multi_word_project: 'code, out, err = self.t(\"project:'three four' list\")':"
"not ok 20 - search.t: 1479: Verify that a description of 'one two' is searchable"
"# ERROR: CommandError on file /tmp/taskwarrior.fc3b336f1accd0b0f99f528726be62d7171003f2/taskwarrior.git/test/search.t line 257 in test_description_with_spaces: 'code, out, err = self.t(\"description:one\\ two list\")':"
230.98s
0.00% 0/0
0.60s
99.72% 3879/3890
W T
"/tmp/taskwarrior.fc3b336f1accd0b0f99f528726be62d7171003f2/taskwarrior.git/src/Variant.cpp:1113:7: warning: this statement may fall through [-Wimplicit-fallthrough=]"
"/tmp/taskwarrior.fc3b336f1accd0b0f99f528726be62d7171003f2/taskwarrior.git/src/recur2.cpp:47:13: warning: \u2018Task upgradeTask(const Task&)\u2019 defined but not used [-Wunused-function]"
"not ok 5 - project.t: 1455: Test project:school)"
"# ERROR: CommandError on file /tmp/taskwarrior.fc3b336f1accd0b0f99f528726be62d7171003f2/taskwarrior.git/test/project.t line 391 in test_project_hierarchy_filter: 'code, out, err = self.t(\"project:two) list\")':"
"not ok 7 - project.t: 1617: Verify search for multi-word project"
"# ERROR: CommandError on file /tmp/taskwarrior.fc3b336f1accd0b0f99f528726be62d7171003f2/taskwarrior.git/test/project.t line 466 in test_multi_word_project: 'code, out, err = self.t(\"project:'three four' list\")':"
"not ok 20 - search.t: 1479: Verify that a description of 'one two' is searchable"
"# ERROR: CommandError on file /tmp/taskwarrior.fc3b336f1accd0b0f99f528726be62d7171003f2/taskwarrior.git/test/search.t line 257 in test_description_with_spaces: 'code, out, err = self.t(\"description:one\\ two list\")':"
"not ok 2 - hyphenate.t: Verify hyphenation in the absence of white space # TODO"
"not ok 1 - feature.default.project.t: default.project is not applied to projectless tasks during sync"
"# ERROR: CommandError on file /tmp/taskwarrior.fc3b336f1accd0b0f99f528726be62d7171003f2/taskwarrior.git/test/feature.default.project.t line 246 in test_default_project_sync: 'self.t1(\"sync\")':"
"not ok 21 - filter.t: filter - description contains +"
"# ERROR: CommandError on file /tmp/taskwarrior.fc3b336f1accd0b0f99f528726be62d7171003f2/taskwarrior.git/test/filter.t line 673 in test_filter_plus_in_descriptions: 'code, out, err = self.t(\"all description.contains:'foobar\\\\+'\")':"
"not ok 24 - filter.t: 1630: Verify that 'due.before:9d' is correctly interpreted"
"# ERROR: CommandError on file /tmp/taskwarrior.fc3b336f1accd0b0f99f528726be62d7171003f2/taskwarrior.git/test/filter.t line 979 in test_attribute_modifier_with_duration: 'code, out, err = self.t(\"due.before:9d list rc.verbose:nothing\")':"
"not ok 25 - filter.t: 1630: Verify that 'due:7d' is correctly interpreted"
"# ERROR: CommandError on file /tmp/taskwarrior.fc3b336f1accd0b0f99f528726be62d7171003f2/taskwarrior.git/test/filter.t line 986 in test_attribute_no_modifier_with_duration: 'code, out, err = self.t(\"due:7d list rc.verbose:nothing\")':"
"not ok 29 - filter.t: 1915: Make sure parser handles complex and-or queries correctly (4)"
"# ERROR: CommandError on file /tmp/taskwarrior.fc3b336f1accd0b0f99f528726be62d7171003f2/taskwarrior.git/test/filter.t line 1069 in test_complex_and_or_query_variant_four: 'code, out, err = self.t(\"rc.verbose:nothing 'status:pending and ( project:A or project:B )' all\")':"
"not ok 33 - filter.t: 1915: Make sure parser handles complex and-or queries correctly (3)"
"# ERROR: CommandError on file /tmp/taskwarrior.fc3b336f1accd0b0f99f528726be62d7171003f2/taskwarrior.git/test/filter.t line 1062 in test_complex_and_or_query_variant_three: 'code, out, err = self.t(\"rc.verbose:nothing 'status:pending and (project:A or project:B)' all\")':"
"not ok 7 - dependencies.t: 697: Verify that making a blocking task into a recurring task breaks dependencies # TODO"
"not ok 18 - dependencies.t: Check that an ID range can be used for deps # TODO"
182.94s
0.00% 0/0
0.02s
0.00% 0/0
0.43s
2019-01-02T13:03:50Z
  6fcbe2ef Locked
  Paul Beckingham
0.00% 0/0
0.09s
99.69% 3878/3890
W T
"/tmp/taskwarrior.6fcbe2efbdb5afcf7c74f29f5aa70ba3e306cb3c/taskwarrior.git/src/Variant.cpp:1113:7: warning: this statement may fall through [-Wimplicit-fallthrough=]"
"/tmp/taskwarrior.6fcbe2efbdb5afcf7c74f29f5aa70ba3e306cb3c/taskwarrior.git/src/recur2.cpp:47:13: warning: \u2018Task upgradeTask(const Task&)\u2019 defined but not used [-Wunused-function]"
"not ok 32 - foo - foo --> error"
"not ok 7 - dependencies.t: 697: Verify that making a blocking task into a recurring task breaks dependencies # TODO"
"not ok 18 - dependencies.t: Check that an ID range can be used for deps # TODO"
"not ok 2 - hyphenate.t: Verify hyphenation in the absence of white space # TODO"
"not ok 21 - filter.t: filter - description contains +"
"# ERROR: CommandError on file /tmp/taskwarrior.6fcbe2efbdb5afcf7c74f29f5aa70ba3e306cb3c/taskwarrior.git/test/filter.t line 673 in test_filter_plus_in_descriptions: 'code, out, err = self.t(\"all description.contains:'foobar\\\\+'\")':"
"not ok 24 - filter.t: 1630: Verify that 'due.before:9d' is correctly interpreted"
"# ERROR: CommandError on file /tmp/taskwarrior.6fcbe2efbdb5afcf7c74f29f5aa70ba3e306cb3c/taskwarrior.git/test/filter.t line 979 in test_attribute_modifier_with_duration: 'code, out, err = self.t(\"due.before:9d list rc.verbose:nothing\")':"
"not ok 25 - filter.t: 1630: Verify that 'due:7d' is correctly interpreted"
"# ERROR: CommandError on file /tmp/taskwarrior.6fcbe2efbdb5afcf7c74f29f5aa70ba3e306cb3c/taskwarrior.git/test/filter.t line 986 in test_attribute_no_modifier_with_duration: 'code, out, err = self.t(\"due:7d list rc.verbose:nothing\")':"
"not ok 29 - filter.t: 1915: Make sure parser handles complex and-or queries correctly (4)"
"# ERROR: CommandError on file /tmp/taskwarrior.6fcbe2efbdb5afcf7c74f29f5aa70ba3e306cb3c/taskwarrior.git/test/filter.t line 1069 in test_complex_and_or_query_variant_four: 'code, out, err = self.t(\"rc.verbose:nothing 'status:pending and ( project:A or project:B )' all\")':"
"not ok 33 - filter.t: 1915: Make sure parser handles complex and-or queries correctly (3)"
"# ERROR: CommandError on file /tmp/taskwarrior.6fcbe2efbdb5afcf7c74f29f5aa70ba3e306cb3c/taskwarrior.git/test/filter.t line 1062 in test_complex_and_or_query_variant_three: 'code, out, err = self.t(\"rc.verbose:nothing 'status:pending and (project:A or project:B)' all\")':"
"not ok 5 - project.t: 1455: Test project:school)"
"# ERROR: CommandError on file /tmp/taskwarrior.6fcbe2efbdb5afcf7c74f29f5aa70ba3e306cb3c/taskwarrior.git/test/project.t line 391 in test_project_hierarchy_filter: 'code, out, err = self.t(\"project:two) list\")':"
"not ok 7 - project.t: 1617: Verify search for multi-word project"
"# ERROR: CommandError on file /tmp/taskwarrior.6fcbe2efbdb5afcf7c74f29f5aa70ba3e306cb3c/taskwarrior.git/test/project.t line 466 in test_multi_word_project: 'code, out, err = self.t(\"project:'three four' list\")':"
"not ok 20 - search.t: 1479: Verify that a description of 'one two' is searchable"
"# ERROR: CommandError on file /tmp/taskwarrior.6fcbe2efbdb5afcf7c74f29f5aa70ba3e306cb3c/taskwarrior.git/test/search.t line 257 in test_description_with_spaces: 'code, out, err = self.t(\"description:one\\ two list\")':"
221.72s
0.00% 0/0
0.06s
99.67% 3877/3890
W T
"/tmp/taskwarrior.6fcbe2efbdb5afcf7c74f29f5aa70ba3e306cb3c/taskwarrior.git/src/Variant.cpp:1113:7: warning: this statement may fall through [-Wimplicit-fallthrough=]"
"/tmp/taskwarrior.6fcbe2efbdb5afcf7c74f29f5aa70ba3e306cb3c/taskwarrior.git/src/recur2.cpp:47:13: warning: \u2018Task upgradeTask(const Task&)\u2019 defined but not used [-Wunused-function]"
"not ok 32 - foo - foo --> error"
"not ok 20 - search.t: 1479: Verify that a description of 'one two' is searchable"
"# ERROR: CommandError on file /tmp/taskwarrior.6fcbe2efbdb5afcf7c74f29f5aa70ba3e306cb3c/taskwarrior.git/test/search.t line 257 in test_description_with_spaces: 'code, out, err = self.t(\"description:one\\ two list\")':"
"not ok 5 - project.t: 1455: Test project:school)"
"# ERROR: CommandError on file /tmp/taskwarrior.6fcbe2efbdb5afcf7c74f29f5aa70ba3e306cb3c/taskwarrior.git/test/project.t line 391 in test_project_hierarchy_filter: 'code, out, err = self.t(\"project:two) list\")':"
"not ok 7 - project.t: 1617: Verify search for multi-word project"
"# ERROR: CommandError on file /tmp/taskwarrior.6fcbe2efbdb5afcf7c74f29f5aa70ba3e306cb3c/taskwarrior.git/test/project.t line 466 in test_multi_word_project: 'code, out, err = self.t(\"project:'three four' list\")':"
"not ok 2 - hyphenate.t: Verify hyphenation in the absence of white space # TODO"
"not ok 1 - feature.default.project.t: default.project is not applied to projectless tasks during sync"
"# ERROR: CommandError on file /tmp/taskwarrior.6fcbe2efbdb5afcf7c74f29f5aa70ba3e306cb3c/taskwarrior.git/test/feature.default.project.t line 246 in test_default_project_sync: 'self.t1(\"sync\")':"
"not ok 21 - filter.t: filter - description contains +"
"# ERROR: CommandError on file /tmp/taskwarrior.6fcbe2efbdb5afcf7c74f29f5aa70ba3e306cb3c/taskwarrior.git/test/filter.t line 673 in test_filter_plus_in_descriptions: 'code, out, err = self.t(\"all description.contains:'foobar\\\\+'\")':"
"not ok 24 - filter.t: 1630: Verify that 'due.before:9d' is correctly interpreted"
"# ERROR: CommandError on file /tmp/taskwarrior.6fcbe2efbdb5afcf7c74f29f5aa70ba3e306cb3c/taskwarrior.git/test/filter.t line 979 in test_attribute_modifier_with_duration: 'code, out, err = self.t(\"due.before:9d list rc.verbose:nothing\")':"
"not ok 25 - filter.t: 1630: Verify that 'due:7d' is correctly interpreted"
"# ERROR: CommandError on file /tmp/taskwarrior.6fcbe2efbdb5afcf7c74f29f5aa70ba3e306cb3c/taskwarrior.git/test/filter.t line 986 in test_attribute_no_modifier_with_duration: 'code, out, err = self.t(\"due:7d list rc.verbose:nothing\")':"
"not ok 29 - filter.t: 1915: Make sure parser handles complex and-or queries correctly (4)"
"# ERROR: CommandError on file /tmp/taskwarrior.6fcbe2efbdb5afcf7c74f29f5aa70ba3e306cb3c/taskwarrior.git/test/filter.t line 1069 in test_complex_and_or_query_variant_four: 'code, out, err = self.t(\"rc.verbose:nothing 'status:pending and ( project:A or project:B )' all\")':"
"not ok 33 - filter.t: 1915: Make sure parser handles complex and-or queries correctly (3)"
"# ERROR: CommandError on file /tmp/taskwarrior.6fcbe2efbdb5afcf7c74f29f5aa70ba3e306cb3c/taskwarrior.git/test/filter.t line 1062 in test_complex_and_or_query_variant_three: 'code, out, err = self.t(\"rc.verbose:nothing 'status:pending and (project:A or project:B)' all\")':"
"not ok 7 - dependencies.t: 697: Verify that making a blocking task into a recurring task breaks dependencies # TODO"
"not ok 18 - dependencies.t: Check that an ID range can be used for deps # TODO"
186.92s
0.00% 0/0
0.05s
0.00% 0/0
0.07s
2019-01-02T13:02:58Z
  24943a44 Locked
  Paul Beckingham
0.00% 0/0
0.08s
99.69% 3878/3890
W T
"/tmp/taskwarrior.24943a441d3606e028d2aaefa1b99cd1f38803f5/taskwarrior.git/src/Variant.cpp:1113:7: warning: this statement may fall through [-Wimplicit-fallthrough=]"
"/tmp/taskwarrior.24943a441d3606e028d2aaefa1b99cd1f38803f5/taskwarrior.git/src/recur2.cpp:47:13: warning: \u2018Task upgradeTask(const Task&)\u2019 defined but not used [-Wunused-function]"
"not ok 32 - foo - foo --> error"
"not ok 7 - dependencies.t: 697: Verify that making a blocking task into a recurring task breaks dependencies # TODO"
"not ok 18 - dependencies.t: Check that an ID range can be used for deps # TODO"
"not ok 2 - hyphenate.t: Verify hyphenation in the absence of white space # TODO"
"not ok 21 - filter.t: filter - description contains +"
"# ERROR: CommandError on file /tmp/taskwarrior.24943a441d3606e028d2aaefa1b99cd1f38803f5/taskwarrior.git/test/filter.t line 673 in test_filter_plus_in_descriptions: 'code, out, err = self.t(\"all description.contains:'foobar\\\\+'\")':"
"not ok 24 - filter.t: 1630: Verify that 'due.before:9d' is correctly interpreted"
"# ERROR: CommandError on file /tmp/taskwarrior.24943a441d3606e028d2aaefa1b99cd1f38803f5/taskwarrior.git/test/filter.t line 979 in test_attribute_modifier_with_duration: 'code, out, err = self.t(\"due.before:9d list rc.verbose:nothing\")':"
"not ok 25 - filter.t: 1630: Verify that 'due:7d' is correctly interpreted"
"# ERROR: CommandError on file /tmp/taskwarrior.24943a441d3606e028d2aaefa1b99cd1f38803f5/taskwarrior.git/test/filter.t line 986 in test_attribute_no_modifier_with_duration: 'code, out, err = self.t(\"due:7d list rc.verbose:nothing\")':"
"not ok 29 - filter.t: 1915: Make sure parser handles complex and-or queries correctly (4)"
"# ERROR: CommandError on file /tmp/taskwarrior.24943a441d3606e028d2aaefa1b99cd1f38803f5/taskwarrior.git/test/filter.t line 1069 in test_complex_and_or_query_variant_four: 'code, out, err = self.t(\"rc.verbose:nothing 'status:pending and ( project:A or project:B )' all\")':"
"not ok 33 - filter.t: 1915: Make sure parser handles complex and-or queries correctly (3)"
"# ERROR: CommandError on file /tmp/taskwarrior.24943a441d3606e028d2aaefa1b99cd1f38803f5/taskwarrior.git/test/filter.t line 1062 in test_complex_and_or_query_variant_three: 'code, out, err = self.t(\"rc.verbose:nothing 'status:pending and (project:A or project:B)' all\")':"
"not ok 5 - project.t: 1455: Test project:school)"
"# ERROR: CommandError on file /tmp/taskwarrior.24943a441d3606e028d2aaefa1b99cd1f38803f5/taskwarrior.git/test/project.t line 391 in test_project_hierarchy_filter: 'code, out, err = self.t(\"project:two) list\")':"
"not ok 7 - project.t: 1617: Verify search for multi-word project"
"# ERROR: CommandError on file /tmp/taskwarrior.24943a441d3606e028d2aaefa1b99cd1f38803f5/taskwarrior.git/test/project.t line 466 in test_multi_word_project: 'code, out, err = self.t(\"project:'three four' list\")':"
"not ok 20 - search.t: 1479: Verify that a description of 'one two' is searchable"
"# ERROR: CommandError on file /tmp/taskwarrior.24943a441d3606e028d2aaefa1b99cd1f38803f5/taskwarrior.git/test/search.t line 257 in test_description_with_spaces: 'code, out, err = self.t(\"description:one\\ two list\")':"
230.20s
0.00% 0/0
0.11s
99.67% 3877/3890
W T
"/tmp/taskwarrior.24943a441d3606e028d2aaefa1b99cd1f38803f5/taskwarrior.git/src/Variant.cpp:1113:7: warning: this statement may fall through [-Wimplicit-fallthrough=]"
"/tmp/taskwarrior.24943a441d3606e028d2aaefa1b99cd1f38803f5/taskwarrior.git/src/recur2.cpp:47:13: warning: \u2018Task upgradeTask(const Task&)\u2019 defined but not used [-Wunused-function]"
"not ok 32 - foo - foo --> error"
"not ok 20 - search.t: 1479: Verify that a description of 'one two' is searchable"
"# ERROR: CommandError on file /tmp/taskwarrior.24943a441d3606e028d2aaefa1b99cd1f38803f5/taskwarrior.git/test/search.t line 257 in test_description_with_spaces: 'code, out, err = self.t(\"description:one\\ two list\")':"
"not ok 5 - project.t: 1455: Test project:school)"
"# ERROR: CommandError on file /tmp/taskwarrior.24943a441d3606e028d2aaefa1b99cd1f38803f5/taskwarrior.git/test/project.t line 391 in test_project_hierarchy_filter: 'code, out, err = self.t(\"project:two) list\")':"
"not ok 7 - project.t: 1617: Verify search for multi-word project"
"# ERROR: CommandError on file /tmp/taskwarrior.24943a441d3606e028d2aaefa1b99cd1f38803f5/taskwarrior.git/test/project.t line 466 in test_multi_word_project: 'code, out, err = self.t(\"project:'three four' list\")':"
"not ok 2 - hyphenate.t: Verify hyphenation in the absence of white space # TODO"
"not ok 1 - feature.default.project.t: default.project is not applied to projectless tasks during sync"
"# ERROR: CommandError on file /tmp/taskwarrior.24943a441d3606e028d2aaefa1b99cd1f38803f5/taskwarrior.git/test/feature.default.project.t line 246 in test_default_project_sync: 'self.t1(\"sync\")':"
"not ok 21 - filter.t: filter - description contains +"
"# ERROR: CommandError on file /tmp/taskwarrior.24943a441d3606e028d2aaefa1b99cd1f38803f5/taskwarrior.git/test/filter.t line 673 in test_filter_plus_in_descriptions: 'code, out, err = self.t(\"all description.contains:'foobar\\\\+'\")':"
"not ok 24 - filter.t: 1630: Verify that 'due.before:9d' is correctly interpreted"
"# ERROR: CommandError on file /tmp/taskwarrior.24943a441d3606e028d2aaefa1b99cd1f38803f5/taskwarrior.git/test/filter.t line 979 in test_attribute_modifier_with_duration: 'code, out, err = self.t(\"due.before:9d list rc.verbose:nothing\")':"
"not ok 25 - filter.t: 1630: Verify that 'due:7d' is correctly interpreted"
"# ERROR: CommandError on file /tmp/taskwarrior.24943a441d3606e028d2aaefa1b99cd1f38803f5/taskwarrior.git/test/filter.t line 986 in test_attribute_no_modifier_with_duration: 'code, out, err = self.t(\"due:7d list rc.verbose:nothing\")':"
"not ok 29 - filter.t: 1915: Make sure parser handles complex and-or queries correctly (4)"
"# ERROR: CommandError on file /tmp/taskwarrior.24943a441d3606e028d2aaefa1b99cd1f38803f5/taskwarrior.git/test/filter.t line 1069 in test_complex_and_or_query_variant_four: 'code, out, err = self.t(\"rc.verbose:nothing 'status:pending and ( project:A or project:B )' all\")':"
"not ok 33 - filter.t: 1915: Make sure parser handles complex and-or queries correctly (3)"
"# ERROR: CommandError on file /tmp/taskwarrior.24943a441d3606e028d2aaefa1b99cd1f38803f5/taskwarrior.git/test/filter.t line 1062 in test_complex_and_or_query_variant_three: 'code, out, err = self.t(\"rc.verbose:nothing 'status:pending and (project:A or project:B)' all\")':"
"not ok 7 - dependencies.t: 697: Verify that making a blocking task into a recurring task breaks dependencies # TODO"
"not ok 18 - dependencies.t: Check that an ID range can be used for deps # TODO"
185.72s
0.00% 0/0
0.07s
0.00% 0/0
0.18s
2019-01-02T13:02:12Z
  660b7c09 Locked
  Paul Beckingham
0.00% 0/0
0.11s
99.69% 3878/3890
W T
"/tmp/taskwarrior.660b7c09af4e705020a2460ed4ed6ae976d8566a/taskwarrior.git/src/Variant.cpp:1113:7: warning: this statement may fall through [-Wimplicit-fallthrough=]"
"/tmp/taskwarrior.660b7c09af4e705020a2460ed4ed6ae976d8566a/taskwarrior.git/src/recur2.cpp:47:13: warning: \u2018Task upgradeTask(const Task&)\u2019 defined but not used [-Wunused-function]"
"not ok 32 - foo - foo --> error"
"not ok 7 - dependencies.t: 697: Verify that making a blocking task into a recurring task breaks dependencies # TODO"
"not ok 18 - dependencies.t: Check that an ID range can be used for deps # TODO"
"not ok 2 - hyphenate.t: Verify hyphenation in the absence of white space # TODO"
"not ok 21 - filter.t: filter - description contains +"
"# ERROR: CommandError on file /tmp/taskwarrior.660b7c09af4e705020a2460ed4ed6ae976d8566a/taskwarrior.git/test/filter.t line 673 in test_filter_plus_in_descriptions: 'code, out, err = self.t(\"all description.contains:'foobar\\\\+'\")':"
"not ok 24 - filter.t: 1630: Verify that 'due.before:9d' is correctly interpreted"
"# ERROR: CommandError on file /tmp/taskwarrior.660b7c09af4e705020a2460ed4ed6ae976d8566a/taskwarrior.git/test/filter.t line 979 in test_attribute_modifier_with_duration: 'code, out, err = self.t(\"due.before:9d list rc.verbose:nothing\")':"
"not ok 25 - filter.t: 1630: Verify that 'due:7d' is correctly interpreted"
"# ERROR: CommandError on file /tmp/taskwarrior.660b7c09af4e705020a2460ed4ed6ae976d8566a/taskwarrior.git/test/filter.t line 986 in test_attribute_no_modifier_with_duration: 'code, out, err = self.t(\"due:7d list rc.verbose:nothing\")':"
"not ok 29 - filter.t: 1915: Make sure parser handles complex and-or queries correctly (4)"
"# ERROR: CommandError on file /tmp/taskwarrior.660b7c09af4e705020a2460ed4ed6ae976d8566a/taskwarrior.git/test/filter.t line 1069 in test_complex_and_or_query_variant_four: 'code, out, err = self.t(\"rc.verbose:nothing 'status:pending and ( project:A or project:B )' all\")':"
"not ok 33 - filter.t: 1915: Make sure parser handles complex and-or queries correctly (3)"
"# ERROR: CommandError on file /tmp/taskwarrior.660b7c09af4e705020a2460ed4ed6ae976d8566a/taskwarrior.git/test/filter.t line 1062 in test_complex_and_or_query_variant_three: 'code, out, err = self.t(\"rc.verbose:nothing 'status:pending and (project:A or project:B)' all\")':"
"not ok 5 - project.t: 1455: Test project:school)"
"# ERROR: CommandError on file /tmp/taskwarrior.660b7c09af4e705020a2460ed4ed6ae976d8566a/taskwarrior.git/test/project.t line 391 in test_project_hierarchy_filter: 'code, out, err = self.t(\"project:two) list\")':"
"not ok 7 - project.t: 1617: Verify search for multi-word project"
"# ERROR: CommandError on file /tmp/taskwarrior.660b7c09af4e705020a2460ed4ed6ae976d8566a/taskwarrior.git/test/project.t line 466 in test_multi_word_project: 'code, out, err = self.t(\"project:'three four' list\")':"
"not ok 20 - search.t: 1479: Verify that a description of 'one two' is searchable"
"# ERROR: CommandError on file /tmp/taskwarrior.660b7c09af4e705020a2460ed4ed6ae976d8566a/taskwarrior.git/test/search.t line 257 in test_description_with_spaces: 'code, out, err = self.t(\"description:one\\ two list\")':"
233.34s
0.00% 0/0
0.11s
99.67% 3877/3890
W T
"/tmp/taskwarrior.660b7c09af4e705020a2460ed4ed6ae976d8566a/taskwarrior.git/src/Variant.cpp:1113:7: warning: this statement may fall through [-Wimplicit-fallthrough=]"
"/tmp/taskwarrior.660b7c09af4e705020a2460ed4ed6ae976d8566a/taskwarrior.git/src/recur2.cpp:47:13: warning: \u2018Task upgradeTask(const Task&)\u2019 defined but not used [-Wunused-function]"
"not ok 32 - foo - foo --> error"
"not ok 20 - search.t: 1479: Verify that a description of 'one two' is searchable"
"# ERROR: CommandError on file /tmp/taskwarrior.660b7c09af4e705020a2460ed4ed6ae976d8566a/taskwarrior.git/test/search.t line 257 in test_description_with_spaces: 'code, out, err = self.t(\"description:one\\ two list\")':"
"not ok 5 - project.t: 1455: Test project:school)"
"# ERROR: CommandError on file /tmp/taskwarrior.660b7c09af4e705020a2460ed4ed6ae976d8566a/taskwarrior.git/test/project.t line 391 in test_project_hierarchy_filter: 'code, out, err = self.t(\"project:two) list\")':"
"not ok 7 - project.t: 1617: Verify search for multi-word project"
"# ERROR: CommandError on file /tmp/taskwarrior.660b7c09af4e705020a2460ed4ed6ae976d8566a/taskwarrior.git/test/project.t line 466 in test_multi_word_project: 'code, out, err = self.t(\"project:'three four' list\")':"
"not ok 2 - hyphenate.t: Verify hyphenation in the absence of white space # TODO"
"not ok 1 - feature.default.project.t: default.project is not applied to projectless tasks during sync"
"# ERROR: CommandError on file /tmp/taskwarrior.660b7c09af4e705020a2460ed4ed6ae976d8566a/taskwarrior.git/test/feature.default.project.t line 246 in test_default_project_sync: 'self.t1(\"sync\")':"
"not ok 21 - filter.t: filter - description contains +"
"# ERROR: CommandError on file /tmp/taskwarrior.660b7c09af4e705020a2460ed4ed6ae976d8566a/taskwarrior.git/test/filter.t line 673 in test_filter_plus_in_descriptions: 'code, out, err = self.t(\"all description.contains:'foobar\\\\+'\")':"
"not ok 24 - filter.t: 1630: Verify that 'due.before:9d' is correctly interpreted"
"# ERROR: CommandError on file /tmp/taskwarrior.660b7c09af4e705020a2460ed4ed6ae976d8566a/taskwarrior.git/test/filter.t line 979 in test_attribute_modifier_with_duration: 'code, out, err = self.t(\"due.before:9d list rc.verbose:nothing\")':"
"not ok 25 - filter.t: 1630: Verify that 'due:7d' is correctly interpreted"
"# ERROR: CommandError on file /tmp/taskwarrior.660b7c09af4e705020a2460ed4ed6ae976d8566a/taskwarrior.git/test/filter.t line 986 in test_attribute_no_modifier_with_duration: 'code, out, err = self.t(\"due:7d list rc.verbose:nothing\")':"
"not ok 29 - filter.t: 1915: Make sure parser handles complex and-or queries correctly (4)"
"# ERROR: CommandError on file /tmp/taskwarrior.660b7c09af4e705020a2460ed4ed6ae976d8566a/taskwarrior.git/test/filter.t line 1069 in test_complex_and_or_query_variant_four: 'code, out, err = self.t(\"rc.verbose:nothing 'status:pending and ( project:A or project:B )' all\")':"
"not ok 33 - filter.t: 1915: Make sure parser handles complex and-or queries correctly (3)"
"# ERROR: CommandError on file /tmp/taskwarrior.660b7c09af4e705020a2460ed4ed6ae976d8566a/taskwarrior.git/test/filter.t line 1062 in test_complex_and_or_query_variant_three: 'code, out, err = self.t(\"rc.verbose:nothing 'status:pending and (project:A or project:B)' all\")':"
"not ok 7 - dependencies.t: 697: Verify that making a blocking task into a recurring task breaks dependencies # TODO"
"not ok 18 - dependencies.t: Check that an ID range can be used for deps # TODO"
190.49s
0.00% 0/0
0.07s
0.00% 0/0
0.07s
2019-01-02T13:00:41Z
  01696a30 Locked
  Paul Beckingham
0.00% 0/0
0.15s
99.69% 3878/3890
W T
"/tmp/taskwarrior.01696a307b6785be973e3e6428e6ade2a3872c1e/taskwarrior.git/src/Variant.cpp:1113:7: warning: this statement may fall through [-Wimplicit-fallthrough=]"
"/tmp/taskwarrior.01696a307b6785be973e3e6428e6ade2a3872c1e/taskwarrior.git/src/recur2.cpp:47:13: warning: \u2018Task upgradeTask(const Task&)\u2019 defined but not used [-Wunused-function]"
"not ok 7 - dependencies.t: 697: Verify that making a blocking task into a recurring task breaks dependencies # TODO"
"not ok 18 - dependencies.t: Check that an ID range can be used for deps # TODO"
"not ok 2 - hyphenate.t: Verify hyphenation in the absence of white space # TODO"
"not ok 21 - filter.t: filter - description contains +"
"# ERROR: CommandError on file /tmp/taskwarrior.01696a307b6785be973e3e6428e6ade2a3872c1e/taskwarrior.git/test/filter.t line 673 in test_filter_plus_in_descriptions: 'code, out, err = self.t(\"all description.contains:'foobar\\\\+'\")':"
"not ok 24 - filter.t: 1630: Verify that 'due.before:9d' is correctly interpreted"
"# ERROR: CommandError on file /tmp/taskwarrior.01696a307b6785be973e3e6428e6ade2a3872c1e/taskwarrior.git/test/filter.t line 979 in test_attribute_modifier_with_duration: 'code, out, err = self.t(\"due.before:9d list rc.verbose:nothing\")':"
"not ok 25 - filter.t: 1630: Verify that 'due:7d' is correctly interpreted"
"# ERROR: CommandError on file /tmp/taskwarrior.01696a307b6785be973e3e6428e6ade2a3872c1e/taskwarrior.git/test/filter.t line 986 in test_attribute_no_modifier_with_duration: 'code, out, err = self.t(\"due:7d list rc.verbose:nothing\")':"
"not ok 29 - filter.t: 1915: Make sure parser handles complex and-or queries correctly (4)"
"# ERROR: CommandError on file /tmp/taskwarrior.01696a307b6785be973e3e6428e6ade2a3872c1e/taskwarrior.git/test/filter.t line 1069 in test_complex_and_or_query_variant_four: 'code, out, err = self.t(\"rc.verbose:nothing 'status:pending and ( project:A or project:B )' all\")':"
"not ok 33 - filter.t: 1915: Make sure parser handles complex and-or queries correctly (3)"
"# ERROR: CommandError on file /tmp/taskwarrior.01696a307b6785be973e3e6428e6ade2a3872c1e/taskwarrior.git/test/filter.t line 1062 in test_complex_and_or_query_variant_three: 'code, out, err = self.t(\"rc.verbose:nothing 'status:pending and (project:A or project:B)' all\")':"
"not ok 5 - project.t: 1455: Test project:school)"
"# ERROR: CommandError on file /tmp/taskwarrior.01696a307b6785be973e3e6428e6ade2a3872c1e/taskwarrior.git/test/project.t line 391 in test_project_hierarchy_filter: 'code, out, err = self.t(\"project:two) list\")':"
"not ok 6 - project.t: 1511: Test project:one-two can be added and queried"
"# ERROR: CommandError on file /tmp/taskwarrior.01696a307b6785be973e3e6428e6ade2a3872c1e/taskwarrior.git/test/project.t line 375 in test_project_hierarchy_filter: 'code, out, err = self.t(\"project:two-three list\")':"
"not ok 7 - project.t: 1617: Verify search for multi-word project"
"# ERROR: CommandError on file /tmp/taskwarrior.01696a307b6785be973e3e6428e6ade2a3872c1e/taskwarrior.git/test/project.t line 466 in test_multi_word_project: 'code, out, err = self.t(\"project:'three four' list\")':"
"not ok 20 - search.t: 1479: Verify that a description of 'one two' is searchable"
"# ERROR: CommandError on file /tmp/taskwarrior.01696a307b6785be973e3e6428e6ade2a3872c1e/taskwarrior.git/test/search.t line 257 in test_description_with_spaces: 'code, out, err = self.t(\"description:one\\ two list\")':"
226.12s
0.00% 0/0
0.09s
99.67% 3877/3890
W T
"/tmp/taskwarrior.01696a307b6785be973e3e6428e6ade2a3872c1e/taskwarrior.git/src/Variant.cpp:1113:7: warning: this statement may fall through [-Wimplicit-fallthrough=]"
"/tmp/taskwarrior.01696a307b6785be973e3e6428e6ade2a3872c1e/taskwarrior.git/src/recur2.cpp:47:13: warning: \u2018Task upgradeTask(const Task&)\u2019 defined but not used [-Wunused-function]"
"not ok 20 - search.t: 1479: Verify that a description of 'one two' is searchable"
"# ERROR: CommandError on file /tmp/taskwarrior.01696a307b6785be973e3e6428e6ade2a3872c1e/taskwarrior.git/test/search.t line 257 in test_description_with_spaces: 'code, out, err = self.t(\"description:one\\ two list\")':"
"not ok 5 - project.t: 1455: Test project:school)"
"# ERROR: CommandError on file /tmp/taskwarrior.01696a307b6785be973e3e6428e6ade2a3872c1e/taskwarrior.git/test/project.t line 391 in test_project_hierarchy_filter: 'code, out, err = self.t(\"project:two) list\")':"
"not ok 6 - project.t: 1511: Test project:one-two can be added and queried"
"# ERROR: CommandError on file /tmp/taskwarrior.01696a307b6785be973e3e6428e6ade2a3872c1e/taskwarrior.git/test/project.t line 375 in test_project_hierarchy_filter: 'code, out, err = self.t(\"project:two-three list\")':"
"not ok 7 - project.t: 1617: Verify search for multi-word project"
"# ERROR: CommandError on file /tmp/taskwarrior.01696a307b6785be973e3e6428e6ade2a3872c1e/taskwarrior.git/test/project.t line 466 in test_multi_word_project: 'code, out, err = self.t(\"project:'three four' list\")':"
"not ok 2 - hyphenate.t: Verify hyphenation in the absence of white space # TODO"
"not ok 1 - feature.default.project.t: default.project is not applied to projectless tasks during sync"
"# ERROR: CommandError on file /tmp/taskwarrior.01696a307b6785be973e3e6428e6ade2a3872c1e/taskwarrior.git/test/feature.default.project.t line 246 in test_default_project_sync: 'self.t1(\"sync\")':"
"not ok 21 - filter.t: filter - description contains +"
"# ERROR: CommandError on file /tmp/taskwarrior.01696a307b6785be973e3e6428e6ade2a3872c1e/taskwarrior.git/test/filter.t line 673 in test_filter_plus_in_descriptions: 'code, out, err = self.t(\"all description.contains:'foobar\\\\+'\")':"
"not ok 24 - filter.t: 1630: Verify that 'due.before:9d' is correctly interpreted"
"# ERROR: CommandError on file /tmp/taskwarrior.01696a307b6785be973e3e6428e6ade2a3872c1e/taskwarrior.git/test/filter.t line 979 in test_attribute_modifier_with_duration: 'code, out, err = self.t(\"due.before:9d list rc.verbose:nothing\")':"
"not ok 25 - filter.t: 1630: Verify that 'due:7d' is correctly interpreted"
"# ERROR: CommandError on file /tmp/taskwarrior.01696a307b6785be973e3e6428e6ade2a3872c1e/taskwarrior.git/test/filter.t line 986 in test_attribute_no_modifier_with_duration: 'code, out, err = self.t(\"due:7d list rc.verbose:nothing\")':"
"not ok 29 - filter.t: 1915: Make sure parser handles complex and-or queries correctly (4)"
"# ERROR: CommandError on file /tmp/taskwarrior.01696a307b6785be973e3e6428e6ade2a3872c1e/taskwarrior.git/test/filter.t line 1069 in test_complex_and_or_query_variant_four: 'code, out, err = self.t(\"rc.verbose:nothing 'status:pending and ( project:A or project:B )' all\")':"
"not ok 33 - filter.t: 1915: Make sure parser handles complex and-or queries correctly (3)"
"# ERROR: CommandError on file /tmp/taskwarrior.01696a307b6785be973e3e6428e6ade2a3872c1e/taskwarrior.git/test/filter.t line 1062 in test_complex_and_or_query_variant_three: 'code, out, err = self.t(\"rc.verbose:nothing 'status:pending and (project:A or project:B)' all\")':"
"not ok 7 - dependencies.t: 697: Verify that making a blocking task into a recurring task breaks dependencies # TODO"
"not ok 18 - dependencies.t: Check that an ID range can be used for deps # TODO"
188.26s
0.00% 0/0
0.05s
0.00% 0/0
0.17s
2019-01-02T02:56:06Z
  bf2cd0f5 Locked
  Tomas Babej
0.00% 0/0
0.06s
0.00% 0/0
W E
"/tmp/taskwarrior.bf2cd0f5e43c7e3aef37bbc34c3101ea800de17c/taskwarrior.git/src/Variant.cpp:1113:7: warning: this statement may fall through [-Wimplicit-fallthrough=]"
"/tmp/taskwarrior.bf2cd0f5e43c7e3aef37bbc34c3101ea800de17c/taskwarrior.git/src/recur2.cpp:47:13: warning: \u2018Task upgradeTask(const Task&)\u2019 defined but not used [-Wunused-function]"
"collect2: error: ld returned 1 exit status"
183.20s
0.00% 0/0
0.07s
0.00% 0/0
W E
"/tmp/taskwarrior.bf2cd0f5e43c7e3aef37bbc34c3101ea800de17c/taskwarrior.git/src/Variant.cpp:1113:7: warning: this statement may fall through [-Wimplicit-fallthrough=]"
"/tmp/taskwarrior.bf2cd0f5e43c7e3aef37bbc34c3101ea800de17c/taskwarrior.git/src/recur2.cpp:47:13: warning: \u2018Task upgradeTask(const Task&)\u2019 defined but not used [-Wunused-function]"
"collect2: error: ld returned 1 exit status"
160.82s
0.00% 0/0
0.03s
0.00% 0/0
0.05s
2019-01-02T02:31:00Z
  9fa94516 Locked
  Tomas Babej
0.00% 0/0
0.06s
99.69% 3878/3890
W T
"/tmp/taskwarrior.9fa94516add12c4834f4f5494b0c4ca2fdc81579/taskwarrior.git/src/Variant.cpp:1113:7: warning: this statement may fall through [-Wimplicit-fallthrough=]"
"/tmp/taskwarrior.9fa94516add12c4834f4f5494b0c4ca2fdc81579/taskwarrior.git/src/recur2.cpp:47:13: warning: \u2018Task upgradeTask(const Task&)\u2019 defined but not used [-Wunused-function]"
"not ok 7 - dependencies.t: 697: Verify that making a blocking task into a recurring task breaks dependencies # TODO"
"not ok 18 - dependencies.t: Check that an ID range can be used for deps # TODO"
"not ok 2 - hyphenate.t: Verify hyphenation in the absence of white space # TODO"
"not ok 21 - filter.t: filter - description contains +"
"# ERROR: CommandError on file /tmp/taskwarrior.9fa94516add12c4834f4f5494b0c4ca2fdc81579/taskwarrior.git/test/filter.t line 673 in test_filter_plus_in_descriptions: 'code, out, err = self.t(\"all description.contains:'foobar\\\\+'\")':"
"not ok 24 - filter.t: 1630: Verify that 'due.before:9d' is correctly interpreted"
"# ERROR: CommandError on file /tmp/taskwarrior.9fa94516add12c4834f4f5494b0c4ca2fdc81579/taskwarrior.git/test/filter.t line 979 in test_attribute_modifier_with_duration: 'code, out, err = self.t(\"due.before:9d list rc.verbose:nothing\")':"
"not ok 25 - filter.t: 1630: Verify that 'due:7d' is correctly interpreted"
"# ERROR: CommandError on file /tmp/taskwarrior.9fa94516add12c4834f4f5494b0c4ca2fdc81579/taskwarrior.git/test/filter.t line 986 in test_attribute_no_modifier_with_duration: 'code, out, err = self.t(\"due:7d list rc.verbose:nothing\")':"
"not ok 29 - filter.t: 1915: Make sure parser handles complex and-or queries correctly (4)"
"# ERROR: CommandError on file /tmp/taskwarrior.9fa94516add12c4834f4f5494b0c4ca2fdc81579/taskwarrior.git/test/filter.t line 1069 in test_complex_and_or_query_variant_four: 'code, out, err = self.t(\"rc.verbose:nothing 'status:pending and ( project:A or project:B )' all\")':"
"not ok 33 - filter.t: 1915: Make sure parser handles complex and-or queries correctly (3)"
"# ERROR: CommandError on file /tmp/taskwarrior.9fa94516add12c4834f4f5494b0c4ca2fdc81579/taskwarrior.git/test/filter.t line 1062 in test_complex_and_or_query_variant_three: 'code, out, err = self.t(\"rc.verbose:nothing 'status:pending and (project:A or project:B)' all\")':"
"not ok 20 - search.t: 1479: Verify that a description of 'one two' is searchable"
"# ERROR: CommandError on file /tmp/taskwarrior.9fa94516add12c4834f4f5494b0c4ca2fdc81579/taskwarrior.git/test/search.t line 257 in test_description_with_spaces: 'code, out, err = self.t(\"description:one\\ two list\")':"
"not ok 5 - project.t: 1455: Test project:school)"
"# ERROR: CommandError on file /tmp/taskwarrior.9fa94516add12c4834f4f5494b0c4ca2fdc81579/taskwarrior.git/test/project.t line 391 in test_project_hierarchy_filter: 'code, out, err = self.t(\"project:two) list\")':"
"not ok 6 - project.t: 1511: Test project:one-two can be added and queried"
"# ERROR: CommandError on file /tmp/taskwarrior.9fa94516add12c4834f4f5494b0c4ca2fdc81579/taskwarrior.git/test/project.t line 375 in test_project_hierarchy_filter: 'code, out, err = self.t(\"project:two-three list\")':"
"not ok 7 - project.t: 1617: Verify search for multi-word project"
"# ERROR: CommandError on file /tmp/taskwarrior.9fa94516add12c4834f4f5494b0c4ca2fdc81579/taskwarrior.git/test/project.t line 466 in test_multi_word_project: 'code, out, err = self.t(\"project:'three four' list\")':"
226.38s
0.00% 0/0
0.05s
99.67% 3877/3890
W T
"/tmp/taskwarrior.9fa94516add12c4834f4f5494b0c4ca2fdc81579/taskwarrior.git/src/Variant.cpp:1113:7: warning: this statement may fall through [-Wimplicit-fallthrough=]"
"/tmp/taskwarrior.9fa94516add12c4834f4f5494b0c4ca2fdc81579/taskwarrior.git/src/recur2.cpp:47:13: warning: \u2018Task upgradeTask(const Task&)\u2019 defined but not used [-Wunused-function]"
"not ok 20 - search.t: 1479: Verify that a description of 'one two' is searchable"
"# ERROR: CommandError on file /tmp/taskwarrior.9fa94516add12c4834f4f5494b0c4ca2fdc81579/taskwarrior.git/test/search.t line 257 in test_description_with_spaces: 'code, out, err = self.t(\"description:one\\ two list\")':"
"not ok 5 - project.t: 1455: Test project:school)"
"# ERROR: CommandError on file /tmp/taskwarrior.9fa94516add12c4834f4f5494b0c4ca2fdc81579/taskwarrior.git/test/project.t line 391 in test_project_hierarchy_filter: 'code, out, err = self.t(\"project:two) list\")':"
"not ok 6 - project.t: 1511: Test project:one-two can be added and queried"
"# ERROR: CommandError on file /tmp/taskwarrior.9fa94516add12c4834f4f5494b0c4ca2fdc81579/taskwarrior.git/test/project.t line 375 in test_project_hierarchy_filter: 'code, out, err = self.t(\"project:two-three list\")':"
"not ok 7 - project.t: 1617: Verify search for multi-word project"
"# ERROR: CommandError on file /tmp/taskwarrior.9fa94516add12c4834f4f5494b0c4ca2fdc81579/taskwarrior.git/test/project.t line 466 in test_multi_word_project: 'code, out, err = self.t(\"project:'three four' list\")':"
"not ok 2 - hyphenate.t: Verify hyphenation in the absence of white space # TODO"
"not ok 1 - feature.default.project.t: default.project is not applied to projectless tasks during sync"
"# ERROR: CommandError on file /tmp/taskwarrior.9fa94516add12c4834f4f5494b0c4ca2fdc81579/taskwarrior.git/test/feature.default.project.t line 246 in test_default_project_sync: 'self.t1(\"sync\")':"
"not ok 21 - filter.t: filter - description contains +"
"# ERROR: CommandError on file /tmp/taskwarrior.9fa94516add12c4834f4f5494b0c4ca2fdc81579/taskwarrior.git/test/filter.t line 673 in test_filter_plus_in_descriptions: 'code, out, err = self.t(\"all description.contains:'foobar\\\\+'\")':"
"not ok 24 - filter.t: 1630: Verify that 'due.before:9d' is correctly interpreted"
"# ERROR: CommandError on file /tmp/taskwarrior.9fa94516add12c4834f4f5494b0c4ca2fdc81579/taskwarrior.git/test/filter.t line 979 in test_attribute_modifier_with_duration: 'code, out, err = self.t(\"due.before:9d list rc.verbose:nothing\")':"
"not ok 25 - filter.t: 1630: Verify that 'due:7d' is correctly interpreted"
"# ERROR: CommandError on file /tmp/taskwarrior.9fa94516add12c4834f4f5494b0c4ca2fdc81579/taskwarrior.git/test/filter.t line 986 in test_attribute_no_modifier_with_duration: 'code, out, err = self.t(\"due:7d list rc.verbose:nothing\")':"
"not ok 29 - filter.t: 1915: Make sure parser handles complex and-or queries correctly (4)"
"# ERROR: CommandError on file /tmp/taskwarrior.9fa94516add12c4834f4f5494b0c4ca2fdc81579/taskwarrior.git/test/filter.t line 1069 in test_complex_and_or_query_variant_four: 'code, out, err = self.t(\"rc.verbose:nothing 'status:pending and ( project:A or project:B )' all\")':"
"not ok 33 - filter.t: 1915: Make sure parser handles complex and-or queries correctly (3)"
"# ERROR: CommandError on file /tmp/taskwarrior.9fa94516add12c4834f4f5494b0c4ca2fdc81579/taskwarrior.git/test/filter.t line 1062 in test_complex_and_or_query_variant_three: 'code, out, err = self.t(\"rc.verbose:nothing 'status:pending and (project:A or project:B)' all\")':"
"not ok 7 - dependencies.t: 697: Verify that making a blocking task into a recurring task breaks dependencies # TODO"
"not ok 18 - dependencies.t: Check that an ID range can be used for deps # TODO"
181.87s
0.00% 0/0
0.04s
0.00% 0/0
0.08s
2019-01-02T01:19:52Z
  55ee8c92 Locked
  Tomas Babej
0.00% 0/0
0.10s
99.67% 3877/3890
W T
"/tmp/taskwarrior.55ee8c9233d5839f6036de6dbe49213a68b1831b/taskwarrior.git/src/Variant.cpp:1113:7: warning: this statement may fall through [-Wimplicit-fallthrough=]"
"/tmp/taskwarrior.55ee8c9233d5839f6036de6dbe49213a68b1831b/taskwarrior.git/src/recur2.cpp:47:13: warning: \u2018Task upgradeTask(const Task&)\u2019 defined but not used [-Wunused-function]"
"not ok 7 - dependencies.t: 697: Verify that making a blocking task into a recurring task breaks dependencies # TODO"
"not ok 18 - dependencies.t: Check that an ID range can be used for deps # TODO"
"not ok 2 - hyphenate.t: Verify hyphenation in the absence of white space # TODO"
"not ok 21 - filter.t: filter - description contains +"
"# ERROR: CommandError on file /tmp/taskwarrior.55ee8c9233d5839f6036de6dbe49213a68b1831b/taskwarrior.git/test/filter.t line 673 in test_filter_plus_in_descriptions: 'code, out, err = self.t(\"all description.contains:'foobar\\\\+'\")':"
"not ok 24 - filter.t: 1630: Verify that 'due.before:9d' is correctly interpreted"
"# ERROR: CommandError on file /tmp/taskwarrior.55ee8c9233d5839f6036de6dbe49213a68b1831b/taskwarrior.git/test/filter.t line 979 in test_attribute_modifier_with_duration: 'code, out, err = self.t(\"due.before:9d list rc.verbose:nothing\")':"
"not ok 25 - filter.t: 1630: Verify that 'due:7d' is correctly interpreted"
"# ERROR: CommandError on file /tmp/taskwarrior.55ee8c9233d5839f6036de6dbe49213a68b1831b/taskwarrior.git/test/filter.t line 986 in test_attribute_no_modifier_with_duration: 'code, out, err = self.t(\"due:7d list rc.verbose:nothing\")':"
"not ok 29 - filter.t: 1915: Make sure parser handles complex and-or queries correctly (4)"
"# ERROR: CommandError on file /tmp/taskwarrior.55ee8c9233d5839f6036de6dbe49213a68b1831b/taskwarrior.git/test/filter.t line 1069 in test_complex_and_or_query_variant_four: 'code, out, err = self.t(\"rc.verbose:nothing 'status:pending and ( project:A or project:B )' all\")':"
"not ok 33 - filter.t: 1915: Make sure parser handles complex and-or queries correctly (3)"
"# ERROR: CommandError on file /tmp/taskwarrior.55ee8c9233d5839f6036de6dbe49213a68b1831b/taskwarrior.git/test/filter.t line 1062 in test_complex_and_or_query_variant_three: 'code, out, err = self.t(\"rc.verbose:nothing 'status:pending and (project:A or project:B)' all\")':"
"not ok 5 - project.t: 1455: Test project:school)"
"# ERROR: CommandError on file /tmp/taskwarrior.55ee8c9233d5839f6036de6dbe49213a68b1831b/taskwarrior.git/test/project.t line 391 in test_project_hierarchy_filter: 'code, out, err = self.t(\"project:two) list\")':"
"not ok 6 - project.t: 1511: Test project:one-two can be added and queried"
"# ERROR: CommandError on file /tmp/taskwarrior.55ee8c9233d5839f6036de6dbe49213a68b1831b/taskwarrior.git/test/project.t line 375 in test_project_hierarchy_filter: 'code, out, err = self.t(\"project:two-three list\")':"
"not ok 7 - project.t: 1617: Verify search for multi-word project"
"# ERROR: CommandError on file /tmp/taskwarrior.55ee8c9233d5839f6036de6dbe49213a68b1831b/taskwarrior.git/test/project.t line 466 in test_multi_word_project: 'code, out, err = self.t(\"project:'three four' list\")':"
"not ok 11 - project.t: 555: log with a project causes a segfault"
"not ok 20 - search.t: 1479: Verify that a description of 'one two' is searchable"
"# ERROR: CommandError on file /tmp/taskwarrior.55ee8c9233d5839f6036de6dbe49213a68b1831b/taskwarrior.git/test/search.t line 257 in test_description_with_spaces: 'code, out, err = self.t(\"description:one\\ two list\")':"
227.53s
0.00% 0/0
0.06s
99.64% 3876/3890
W T
"/tmp/taskwarrior.55ee8c9233d5839f6036de6dbe49213a68b1831b/taskwarrior.git/src/Variant.cpp:1113:7: warning: this statement may fall through [-Wimplicit-fallthrough=]"
"/tmp/taskwarrior.55ee8c9233d5839f6036de6dbe49213a68b1831b/taskwarrior.git/src/recur2.cpp:47:13: warning: \u2018Task upgradeTask(const Task&)\u2019 defined but not used [-Wunused-function]"
"not ok 5 - project.t: 1455: Test project:school)"
"# ERROR: CommandError on file /tmp/taskwarrior.55ee8c9233d5839f6036de6dbe49213a68b1831b/taskwarrior.git/test/project.t line 391 in test_project_hierarchy_filter: 'code, out, err = self.t(\"project:two) list\")':"
"not ok 6 - project.t: 1511: Test project:one-two can be added and queried"
"# ERROR: CommandError on file /tmp/taskwarrior.55ee8c9233d5839f6036de6dbe49213a68b1831b/taskwarrior.git/test/project.t line 375 in test_project_hierarchy_filter: 'code, out, err = self.t(\"project:two-three list\")':"
"not ok 7 - project.t: 1617: Verify search for multi-word project"
"# ERROR: CommandError on file /tmp/taskwarrior.55ee8c9233d5839f6036de6dbe49213a68b1831b/taskwarrior.git/test/project.t line 466 in test_multi_word_project: 'code, out, err = self.t(\"project:'three four' list\")':"
"not ok 11 - project.t: 555: log with a project causes a segfault"
"not ok 20 - search.t: 1479: Verify that a description of 'one two' is searchable"
"# ERROR: CommandError on file /tmp/taskwarrior.55ee8c9233d5839f6036de6dbe49213a68b1831b/taskwarrior.git/test/search.t line 257 in test_description_with_spaces: 'code, out, err = self.t(\"description:one\\ two list\")':"
"not ok 2 - hyphenate.t: Verify hyphenation in the absence of white space # TODO"
"not ok 1 - feature.default.project.t: default.project is not applied to projectless tasks during sync"
"# ERROR: CommandError on file /tmp/taskwarrior.55ee8c9233d5839f6036de6dbe49213a68b1831b/taskwarrior.git/test/feature.default.project.t line 246 in test_default_project_sync: 'self.t1(\"sync\")':"
"not ok 21 - filter.t: filter - description contains +"
"# ERROR: CommandError on file /tmp/taskwarrior.55ee8c9233d5839f6036de6dbe49213a68b1831b/taskwarrior.git/test/filter.t line 673 in test_filter_plus_in_descriptions: 'code, out, err = self.t(\"all description.contains:'foobar\\\\+'\")':"
"not ok 24 - filter.t: 1630: Verify that 'due.before:9d' is correctly interpreted"
"# ERROR: CommandError on file /tmp/taskwarrior.55ee8c9233d5839f6036de6dbe49213a68b1831b/taskwarrior.git/test/filter.t line 979 in test_attribute_modifier_with_duration: 'code, out, err = self.t(\"due.before:9d list rc.verbose:nothing\")':"
"not ok 25 - filter.t: 1630: Verify that 'due:7d' is correctly interpreted"
"# ERROR: CommandError on file /tmp/taskwarrior.55ee8c9233d5839f6036de6dbe49213a68b1831b/taskwarrior.git/test/filter.t line 986 in test_attribute_no_modifier_with_duration: 'code, out, err = self.t(\"due:7d list rc.verbose:nothing\")':"
"not ok 29 - filter.t: 1915: Make sure parser handles complex and-or queries correctly (4)"
"# ERROR: CommandError on file /tmp/taskwarrior.55ee8c9233d5839f6036de6dbe49213a68b1831b/taskwarrior.git/test/filter.t line 1069 in test_complex_and_or_query_variant_four: 'code, out, err = self.t(\"rc.verbose:nothing 'status:pending and ( project:A or project:B )' all\")':"
"not ok 33 - filter.t: 1915: Make sure parser handles complex and-or queries correctly (3)"
"# ERROR: CommandError on file /tmp/taskwarrior.55ee8c9233d5839f6036de6dbe49213a68b1831b/taskwarrior.git/test/filter.t line 1062 in test_complex_and_or_query_variant_three: 'code, out, err = self.t(\"rc.verbose:nothing 'status:pending and (project:A or project:B)' all\")':"
"not ok 7 - dependencies.t: 697: Verify that making a blocking task into a recurring task breaks dependencies # TODO"
"not ok 18 - dependencies.t: Check that an ID range can be used for deps # TODO"
185.43s
0.00% 0/0
0.03s
0.00% 0/0
0.08s
2019-01-02T01:11:13Z
  9b690fca Locked
  Tomas Babej
0.00% 0/0
0.27s
99.67% 3877/3890
W T
"/tmp/taskwarrior.9b690fca57d95c4054bc1fc93531917e59af58c4/taskwarrior.git/src/Variant.cpp:1113:7: warning: this statement may fall through [-Wimplicit-fallthrough=]"
"/tmp/taskwarrior.9b690fca57d95c4054bc1fc93531917e59af58c4/taskwarrior.git/src/recur2.cpp:47:13: warning: \u2018Task upgradeTask(const Task&)\u2019 defined but not used [-Wunused-function]"
"not ok 7 - dependencies.t: 697: Verify that making a blocking task into a recurring task breaks dependencies # TODO"
"not ok 18 - dependencies.t: Check that an ID range can be used for deps # TODO"
"not ok 2 - hyphenate.t: Verify hyphenation in the absence of white space # TODO"
"not ok 21 - filter.t: filter - description contains +"
"# ERROR: CommandError on file /tmp/taskwarrior.9b690fca57d95c4054bc1fc93531917e59af58c4/taskwarrior.git/test/filter.t line 673 in test_filter_plus_in_descriptions: 'code, out, err = self.t(\"all description.contains:'foobar\\\\+'\")':"
"not ok 24 - filter.t: 1630: Verify that 'due.before:9d' is correctly interpreted"
"# ERROR: CommandError on file /tmp/taskwarrior.9b690fca57d95c4054bc1fc93531917e59af58c4/taskwarrior.git/test/filter.t line 979 in test_attribute_modifier_with_duration: 'code, out, err = self.t(\"due.before:9d list rc.verbose:nothing\")':"
"not ok 25 - filter.t: 1630: Verify that 'due:7d' is correctly interpreted"
"# ERROR: CommandError on file /tmp/taskwarrior.9b690fca57d95c4054bc1fc93531917e59af58c4/taskwarrior.git/test/filter.t line 986 in test_attribute_no_modifier_with_duration: 'code, out, err = self.t(\"due:7d list rc.verbose:nothing\")':"
"not ok 29 - filter.t: 1915: Make sure parser handles complex and-or queries correctly (4)"
"# ERROR: CommandError on file /tmp/taskwarrior.9b690fca57d95c4054bc1fc93531917e59af58c4/taskwarrior.git/test/filter.t line 1069 in test_complex_and_or_query_variant_four: 'code, out, err = self.t(\"rc.verbose:nothing 'status:pending and ( project:A or project:B )' all\")':"
"not ok 33 - filter.t: 1915: Make sure parser handles complex and-or queries correctly (3)"
"# ERROR: CommandError on file /tmp/taskwarrior.9b690fca57d95c4054bc1fc93531917e59af58c4/taskwarrior.git/test/filter.t line 1062 in test_complex_and_or_query_variant_three: 'code, out, err = self.t(\"rc.verbose:nothing 'status:pending and (project:A or project:B)' all\")':"
"not ok 5 - project.t: 1455: Test project:school)"
"# ERROR: CommandError on file /tmp/taskwarrior.9b690fca57d95c4054bc1fc93531917e59af58c4/taskwarrior.git/test/project.t line 391 in test_project_hierarchy_filter: 'code, out, err = self.t(\"project:two) list\")':"
"not ok 6 - project.t: 1511: Test project:one-two can be added and queried"
"# ERROR: CommandError on file /tmp/taskwarrior.9b690fca57d95c4054bc1fc93531917e59af58c4/taskwarrior.git/test/project.t line 375 in test_project_hierarchy_filter: 'code, out, err = self.t(\"project:two-three list\")':"
"not ok 7 - project.t: 1617: Verify search for multi-word project"
"# ERROR: CommandError on file /tmp/taskwarrior.9b690fca57d95c4054bc1fc93531917e59af58c4/taskwarrior.git/test/project.t line 466 in test_multi_word_project: 'code, out, err = self.t(\"project:'three four' list\")':"
"not ok 11 - project.t: 555: log with a project causes a segfault"
"not ok 20 - search.t: 1479: Verify that a description of 'one two' is searchable"
"# ERROR: CommandError on file /tmp/taskwarrior.9b690fca57d95c4054bc1fc93531917e59af58c4/taskwarrior.git/test/search.t line 257 in test_description_with_spaces: 'code, out, err = self.t(\"description:one\\ two list\")':"
234.82s
0.00% 0/0
0.10s
99.64% 3876/3890
W T
"/tmp/taskwarrior.9b690fca57d95c4054bc1fc93531917e59af58c4/taskwarrior.git/src/Variant.cpp:1113:7: warning: this statement may fall through [-Wimplicit-fallthrough=]"
"/tmp/taskwarrior.9b690fca57d95c4054bc1fc93531917e59af58c4/taskwarrior.git/src/recur2.cpp:47:13: warning: \u2018Task upgradeTask(const Task&)\u2019 defined but not used [-Wunused-function]"
"not ok 5 - project.t: 1455: Test project:school)"
"# ERROR: CommandError on file /tmp/taskwarrior.9b690fca57d95c4054bc1fc93531917e59af58c4/taskwarrior.git/test/project.t line 391 in test_project_hierarchy_filter: 'code, out, err = self.t(\"project:two) list\")':"
"not ok 6 - project.t: 1511: Test project:one-two can be added and queried"
"# ERROR: CommandError on file /tmp/taskwarrior.9b690fca57d95c4054bc1fc93531917e59af58c4/taskwarrior.git/test/project.t line 375 in test_project_hierarchy_filter: 'code, out, err = self.t(\"project:two-three list\")':"
"not ok 7 - project.t: 1617: Verify search for multi-word project"
"# ERROR: CommandError on file /tmp/taskwarrior.9b690fca57d95c4054bc1fc93531917e59af58c4/taskwarrior.git/test/project.t line 466 in test_multi_word_project: 'code, out, err = self.t(\"project:'three four' list\")':"
"not ok 11 - project.t: 555: log with a project causes a segfault"
"not ok 20 - search.t: 1479: Verify that a description of 'one two' is searchable"
"# ERROR: CommandError on file /tmp/taskwarrior.9b690fca57d95c4054bc1fc93531917e59af58c4/taskwarrior.git/test/search.t line 257 in test_description_with_spaces: 'code, out, err = self.t(\"description:one\\ two list\")':"
"not ok 2 - hyphenate.t: Verify hyphenation in the absence of white space # TODO"
"not ok 1 - feature.default.project.t: default.project is not applied to projectless tasks during sync"
"# ERROR: CommandError on file /tmp/taskwarrior.9b690fca57d95c4054bc1fc93531917e59af58c4/taskwarrior.git/test/feature.default.project.t line 246 in test_default_project_sync: 'self.t1(\"sync\")':"
"not ok 21 - filter.t: filter - description contains +"
"# ERROR: CommandError on file /tmp/taskwarrior.9b690fca57d95c4054bc1fc93531917e59af58c4/taskwarrior.git/test/filter.t line 673 in test_filter_plus_in_descriptions: 'code, out, err = self.t(\"all description.contains:'foobar\\\\+'\")':"
"not ok 24 - filter.t: 1630: Verify that 'due.before:9d' is correctly interpreted"
"# ERROR: CommandError on file /tmp/taskwarrior.9b690fca57d95c4054bc1fc93531917e59af58c4/taskwarrior.git/test/filter.t line 979 in test_attribute_modifier_with_duration: 'code, out, err = self.t(\"due.before:9d list rc.verbose:nothing\")':"
"not ok 25 - filter.t: 1630: Verify that 'due:7d' is correctly interpreted"
"# ERROR: CommandError on file /tmp/taskwarrior.9b690fca57d95c4054bc1fc93531917e59af58c4/taskwarrior.git/test/filter.t line 986 in test_attribute_no_modifier_with_duration: 'code, out, err = self.t(\"due:7d list rc.verbose:nothing\")':"
"not ok 29 - filter.t: 1915: Make sure parser handles complex and-or queries correctly (4)"
"# ERROR: CommandError on file /tmp/taskwarrior.9b690fca57d95c4054bc1fc93531917e59af58c4/taskwarrior.git/test/filter.t line 1069 in test_complex_and_or_query_variant_four: 'code, out, err = self.t(\"rc.verbose:nothing 'status:pending and ( project:A or project:B )' all\")':"
"not ok 33 - filter.t: 1915: Make sure parser handles complex and-or queries correctly (3)"
"# ERROR: CommandError on file /tmp/taskwarrior.9b690fca57d95c4054bc1fc93531917e59af58c4/taskwarrior.git/test/filter.t line 1062 in test_complex_and_or_query_variant_three: 'code, out, err = self.t(\"rc.verbose:nothing 'status:pending and (project:A or project:B)' all\")':"
"not ok 7 - dependencies.t: 697: Verify that making a blocking task into a recurring task breaks dependencies # TODO"
"not ok 18 - dependencies.t: Check that an ID range can be used for deps # TODO"
185.49s
0.00% 0/0
0.07s
0.00% 0/0
0.11s
2019-01-02T01:02:20Z
  7aac91f2 Locked
  Tomas Babej
0.00% 0/0
0.07s
99.67% 3877/3890
W T
"/tmp/taskwarrior.7aac91f29f1eafd2ec981196249cf3c62d435485/taskwarrior.git/src/Variant.cpp:1113:7: warning: this statement may fall through [-Wimplicit-fallthrough=]"
"/tmp/taskwarrior.7aac91f29f1eafd2ec981196249cf3c62d435485/taskwarrior.git/src/recur2.cpp:47:13: warning: \u2018Task upgradeTask(const Task&)\u2019 defined but not used [-Wunused-function]"
"not ok 7 - dependencies.t: 697: Verify that making a blocking task into a recurring task breaks dependencies # TODO"
"not ok 18 - dependencies.t: Check that an ID range can be used for deps # TODO"
"not ok 2 - hyphenate.t: Verify hyphenation in the absence of white space # TODO"
"not ok 21 - filter.t: filter - description contains +"
"# ERROR: CommandError on file /tmp/taskwarrior.7aac91f29f1eafd2ec981196249cf3c62d435485/taskwarrior.git/test/filter.t line 673 in test_filter_plus_in_descriptions: 'code, out, err = self.t(\"all description.contains:'foobar\\\\+'\")':"
"not ok 24 - filter.t: 1630: Verify that 'due.before:9d' is correctly interpreted"
"# ERROR: CommandError on file /tmp/taskwarrior.7aac91f29f1eafd2ec981196249cf3c62d435485/taskwarrior.git/test/filter.t line 979 in test_attribute_modifier_with_duration: 'code, out, err = self.t(\"due.before:9d list rc.verbose:nothing\")':"
"not ok 25 - filter.t: 1630: Verify that 'due:7d' is correctly interpreted"
"# ERROR: CommandError on file /tmp/taskwarrior.7aac91f29f1eafd2ec981196249cf3c62d435485/taskwarrior.git/test/filter.t line 986 in test_attribute_no_modifier_with_duration: 'code, out, err = self.t(\"due:7d list rc.verbose:nothing\")':"
"not ok 29 - filter.t: 1915: Make sure parser handles complex and-or queries correctly (4)"
"# ERROR: CommandError on file /tmp/taskwarrior.7aac91f29f1eafd2ec981196249cf3c62d435485/taskwarrior.git/test/filter.t line 1069 in test_complex_and_or_query_variant_four: 'code, out, err = self.t(\"rc.verbose:nothing 'status:pending and ( project:A or project:B )' all\")':"
"not ok 33 - filter.t: 1915: Make sure parser handles complex and-or queries correctly (3)"
"# ERROR: CommandError on file /tmp/taskwarrior.7aac91f29f1eafd2ec981196249cf3c62d435485/taskwarrior.git/test/filter.t line 1062 in test_complex_and_or_query_variant_three: 'code, out, err = self.t(\"rc.verbose:nothing 'status:pending and (project:A or project:B)' all\")':"
"not ok 5 - project.t: 1455: Test project:school)"
"# ERROR: CommandError on file /tmp/taskwarrior.7aac91f29f1eafd2ec981196249cf3c62d435485/taskwarrior.git/test/project.t line 391 in test_project_hierarchy_filter: 'code, out, err = self.t(\"project:two) list\")':"
"not ok 6 - project.t: 1511: Test project:one-two can be added and queried"
"# ERROR: CommandError on file /tmp/taskwarrior.7aac91f29f1eafd2ec981196249cf3c62d435485/taskwarrior.git/test/project.t line 375 in test_project_hierarchy_filter: 'code, out, err = self.t(\"project:two-three list\")':"
"not ok 7 - project.t: 1617: Verify search for multi-word project"
"# ERROR: CommandError on file /tmp/taskwarrior.7aac91f29f1eafd2ec981196249cf3c62d435485/taskwarrior.git/test/project.t line 466 in test_multi_word_project: 'code, out, err = self.t(\"project:'three four' list\")':"
"not ok 11 - project.t: 555: log with a project causes a segfault"
"not ok 20 - search.t: 1479: Verify that a description of 'one two' is searchable"
"# ERROR: CommandError on file /tmp/taskwarrior.7aac91f29f1eafd2ec981196249cf3c62d435485/taskwarrior.git/test/search.t line 257 in test_description_with_spaces: 'code, out, err = self.t(\"description:one\\ two list\")':"
232.05s
0.00% 0/0
0.19s
99.64% 3876/3890
W T
"/tmp/taskwarrior.7aac91f29f1eafd2ec981196249cf3c62d435485/taskwarrior.git/src/Variant.cpp:1113:7: warning: this statement may fall through [-Wimplicit-fallthrough=]"
"/tmp/taskwarrior.7aac91f29f1eafd2ec981196249cf3c62d435485/taskwarrior.git/src/recur2.cpp:47:13: warning: \u2018Task upgradeTask(const Task&)\u2019 defined but not used [-Wunused-function]"
"not ok 5 - project.t: 1455: Test project:school)"
"# ERROR: CommandError on file /tmp/taskwarrior.7aac91f29f1eafd2ec981196249cf3c62d435485/taskwarrior.git/test/project.t line 391 in test_project_hierarchy_filter: 'code, out, err = self.t(\"project:two) list\")':"
"not ok 6 - project.t: 1511: Test project:one-two can be added and queried"
"# ERROR: CommandError on file /tmp/taskwarrior.7aac91f29f1eafd2ec981196249cf3c62d435485/taskwarrior.git/test/project.t line 375 in test_project_hierarchy_filter: 'code, out, err = self.t(\"project:two-three list\")':"
"not ok 7 - project.t: 1617: Verify search for multi-word project"
"# ERROR: CommandError on file /tmp/taskwarrior.7aac91f29f1eafd2ec981196249cf3c62d435485/taskwarrior.git/test/project.t line 466 in test_multi_word_project: 'code, out, err = self.t(\"project:'three four' list\")':"
"not ok 11 - project.t: 555: log with a project causes a segfault"
"not ok 20 - search.t: 1479: Verify that a description of 'one two' is searchable"
"# ERROR: CommandError on file /tmp/taskwarrior.7aac91f29f1eafd2ec981196249cf3c62d435485/taskwarrior.git/test/search.t line 257 in test_description_with_spaces: 'code, out, err = self.t(\"description:one\\ two list\")':"
"not ok 2 - hyphenate.t: Verify hyphenation in the absence of white space # TODO"
"not ok 1 - feature.default.project.t: default.project is not applied to projectless tasks during sync"
"# ERROR: CommandError on file /tmp/taskwarrior.7aac91f29f1eafd2ec981196249cf3c62d435485/taskwarrior.git/test/feature.default.project.t line 246 in test_default_project_sync: 'self.t1(\"sync\")':"
"not ok 21 - filter.t: filter - description contains +"
"# ERROR: CommandError on file /tmp/taskwarrior.7aac91f29f1eafd2ec981196249cf3c62d435485/taskwarrior.git/test/filter.t line 673 in test_filter_plus_in_descriptions: 'code, out, err = self.t(\"all description.contains:'foobar\\\\+'\")':"
"not ok 24 - filter.t: 1630: Verify that 'due.before:9d' is correctly interpreted"
"# ERROR: CommandError on file /tmp/taskwarrior.7aac91f29f1eafd2ec981196249cf3c62d435485/taskwarrior.git/test/filter.t line 979 in test_attribute_modifier_with_duration: 'code, out, err = self.t(\"due.before:9d list rc.verbose:nothing\")':"
"not ok 25 - filter.t: 1630: Verify that 'due:7d' is correctly interpreted"
"# ERROR: CommandError on file /tmp/taskwarrior.7aac91f29f1eafd2ec981196249cf3c62d435485/taskwarrior.git/test/filter.t line 986 in test_attribute_no_modifier_with_duration: 'code, out, err = self.t(\"due:7d list rc.verbose:nothing\")':"
"not ok 29 - filter.t: 1915: Make sure parser handles complex and-or queries correctly (4)"
"# ERROR: CommandError on file /tmp/taskwarrior.7aac91f29f1eafd2ec981196249cf3c62d435485/taskwarrior.git/test/filter.t line 1069 in test_complex_and_or_query_variant_four: 'code, out, err = self.t(\"rc.verbose:nothing 'status:pending and ( project:A or project:B )' all\")':"
"not ok 33 - filter.t: 1915: Make sure parser handles complex and-or queries correctly (3)"
"# ERROR: CommandError on file /tmp/taskwarrior.7aac91f29f1eafd2ec981196249cf3c62d435485/taskwarrior.git/test/filter.t line 1062 in test_complex_and_or_query_variant_three: 'code, out, err = self.t(\"rc.verbose:nothing 'status:pending and (project:A or project:B)' all\")':"
"not ok 7 - dependencies.t: 697: Verify that making a blocking task into a recurring task breaks dependencies # TODO"
"not ok 18 - dependencies.t: Check that an ID range can be used for deps # TODO"
184.28s
0.00% 0/0
0.02s
0.00% 0/0
0.03s
2019-01-02T00:46:32Z
  0e052b64 Locked
  Tomas Babej
0.00% 0/0
0.09s
99.67% 3877/3890
W T
"/tmp/taskwarrior.0e052b641514f9bf4ced111a0843dca04194e896/taskwarrior.git/src/Variant.cpp:1113:7: warning: this statement may fall through [-Wimplicit-fallthrough=]"
"/tmp/taskwarrior.0e052b641514f9bf4ced111a0843dca04194e896/taskwarrior.git/src/recur2.cpp:47:13: warning: \u2018Task upgradeTask(const Task&)\u2019 defined but not used [-Wunused-function]"
"not ok 7 - dependencies.t: 697: Verify that making a blocking task into a recurring task breaks dependencies # TODO"
"not ok 18 - dependencies.t: Check that an ID range can be used for deps # TODO"
"not ok 2 - hyphenate.t: Verify hyphenation in the absence of white space # TODO"
"not ok 21 - filter.t: filter - description contains +"
"# ERROR: CommandError on file /tmp/taskwarrior.0e052b641514f9bf4ced111a0843dca04194e896/taskwarrior.git/test/filter.t line 673 in test_filter_plus_in_descriptions: 'code, out, err = self.t(\"all description.contains:'foobar\\\\+'\")':"
"not ok 24 - filter.t: 1630: Verify that 'due.before:9d' is correctly interpreted"
"# ERROR: CommandError on file /tmp/taskwarrior.0e052b641514f9bf4ced111a0843dca04194e896/taskwarrior.git/test/filter.t line 979 in test_attribute_modifier_with_duration: 'code, out, err = self.t(\"due.before:9d list rc.verbose:nothing\")':"
"not ok 25 - filter.t: 1630: Verify that 'due:7d' is correctly interpreted"
"# ERROR: CommandError on file /tmp/taskwarrior.0e052b641514f9bf4ced111a0843dca04194e896/taskwarrior.git/test/filter.t line 986 in test_attribute_no_modifier_with_duration: 'code, out, err = self.t(\"due:7d list rc.verbose:nothing\")':"
"not ok 29 - filter.t: 1915: Make sure parser handles complex and-or queries correctly (4)"
"# ERROR: CommandError on file /tmp/taskwarrior.0e052b641514f9bf4ced111a0843dca04194e896/taskwarrior.git/test/filter.t line 1069 in test_complex_and_or_query_variant_four: 'code, out, err = self.t(\"rc.verbose:nothing 'status:pending and ( project:A or project:B )' all\")':"
"not ok 33 - filter.t: 1915: Make sure parser handles complex and-or queries correctly (3)"
"# ERROR: CommandError on file /tmp/taskwarrior.0e052b641514f9bf4ced111a0843dca04194e896/taskwarrior.git/test/filter.t line 1062 in test_complex_and_or_query_variant_three: 'code, out, err = self.t(\"rc.verbose:nothing 'status:pending and (project:A or project:B)' all\")':"
"not ok 5 - project.t: 1455: Test project:school)"
"# ERROR: CommandError on file /tmp/taskwarrior.0e052b641514f9bf4ced111a0843dca04194e896/taskwarrior.git/test/project.t line 391 in test_project_hierarchy_filter: 'code, out, err = self.t(\"project:two) list\")':"
"not ok 6 - project.t: 1511: Test project:one-two can be added and queried"
"# ERROR: CommandError on file /tmp/taskwarrior.0e052b641514f9bf4ced111a0843dca04194e896/taskwarrior.git/test/project.t line 375 in test_project_hierarchy_filter: 'code, out, err = self.t(\"project:two-three list\")':"
"not ok 7 - project.t: 1617: Verify search for multi-word project"
"# ERROR: CommandError on file /tmp/taskwarrior.0e052b641514f9bf4ced111a0843dca04194e896/taskwarrior.git/test/project.t line 466 in test_multi_word_project: 'code, out, err = self.t(\"project:'three four' list\")':"
"not ok 11 - project.t: 555: log with a project causes a segfault"
"not ok 20 - search.t: 1479: Verify that a description of 'one two' is searchable"
"# ERROR: CommandError on file /tmp/taskwarrior.0e052b641514f9bf4ced111a0843dca04194e896/taskwarrior.git/test/search.t line 257 in test_description_with_spaces: 'code, out, err = self.t(\"description:one\\ two list\")':"
230.41s
0.00% 0/0
0.09s
99.64% 3876/3890
W T
"/tmp/taskwarrior.0e052b641514f9bf4ced111a0843dca04194e896/taskwarrior.git/src/Variant.cpp:1113:7: warning: this statement may fall through [-Wimplicit-fallthrough=]"
"/tmp/taskwarrior.0e052b641514f9bf4ced111a0843dca04194e896/taskwarrior.git/src/recur2.cpp:47:13: warning: \u2018Task upgradeTask(const Task&)\u2019 defined but not used [-Wunused-function]"
"not ok 5 - project.t: 1455: Test project:school)"
"# ERROR: CommandError on file /tmp/taskwarrior.0e052b641514f9bf4ced111a0843dca04194e896/taskwarrior.git/test/project.t line 391 in test_project_hierarchy_filter: 'code, out, err = self.t(\"project:two) list\")':"
"not ok 6 - project.t: 1511: Test project:one-two can be added and queried"
"# ERROR: CommandError on file /tmp/taskwarrior.0e052b641514f9bf4ced111a0843dca04194e896/taskwarrior.git/test/project.t line 375 in test_project_hierarchy_filter: 'code, out, err = self.t(\"project:two-three list\")':"
"not ok 7 - project.t: 1617: Verify search for multi-word project"
"# ERROR: CommandError on file /tmp/taskwarrior.0e052b641514f9bf4ced111a0843dca04194e896/taskwarrior.git/test/project.t line 466 in test_multi_word_project: 'code, out, err = self.t(\"project:'three four' list\")':"
"not ok 11 - project.t: 555: log with a project causes a segfault"
"not ok 20 - search.t: 1479: Verify that a description of 'one two' is searchable"
"# ERROR: CommandError on file /tmp/taskwarrior.0e052b641514f9bf4ced111a0843dca04194e896/taskwarrior.git/test/search.t line 257 in test_description_with_spaces: 'code, out, err = self.t(\"description:one\\ two list\")':"
"not ok 2 - hyphenate.t: Verify hyphenation in the absence of white space # TODO"
"not ok 1 - feature.default.project.t: default.project is not applied to projectless tasks during sync"
"# ERROR: CommandError on file /tmp/taskwarrior.0e052b641514f9bf4ced111a0843dca04194e896/taskwarrior.git/test/feature.default.project.t line 246 in test_default_project_sync: 'self.t1(\"sync\")':"
"not ok 21 - filter.t: filter - description contains +"
"# ERROR: CommandError on file /tmp/taskwarrior.0e052b641514f9bf4ced111a0843dca04194e896/taskwarrior.git/test/filter.t line 673 in test_filter_plus_in_descriptions: 'code, out, err = self.t(\"all description.contains:'foobar\\\\+'\")':"
"not ok 24 - filter.t: 1630: Verify that 'due.before:9d' is correctly interpreted"
"# ERROR: CommandError on file /tmp/taskwarrior.0e052b641514f9bf4ced111a0843dca04194e896/taskwarrior.git/test/filter.t line 979 in test_attribute_modifier_with_duration: 'code, out, err = self.t(\"due.before:9d list rc.verbose:nothing\")':"
"not ok 25 - filter.t: 1630: Verify that 'due:7d' is correctly interpreted"
"# ERROR: CommandError on file /tmp/taskwarrior.0e052b641514f9bf4ced111a0843dca04194e896/taskwarrior.git/test/filter.t line 986 in test_attribute_no_modifier_with_duration: 'code, out, err = self.t(\"due:7d list rc.verbose:nothing\")':"
"not ok 29 - filter.t: 1915: Make sure parser handles complex and-or queries correctly (4)"
"# ERROR: CommandError on file /tmp/taskwarrior.0e052b641514f9bf4ced111a0843dca04194e896/taskwarrior.git/test/filter.t line 1069 in test_complex_and_or_query_variant_four: 'code, out, err = self.t(\"rc.verbose:nothing 'status:pending and ( project:A or project:B )' all\")':"
"not ok 33 - filter.t: 1915: Make sure parser handles complex and-or queries correctly (3)"
"# ERROR: CommandError on file /tmp/taskwarrior.0e052b641514f9bf4ced111a0843dca04194e896/taskwarrior.git/test/filter.t line 1062 in test_complex_and_or_query_variant_three: 'code, out, err = self.t(\"rc.verbose:nothing 'status:pending and (project:A or project:B)' all\")':"
"not ok 7 - dependencies.t: 697: Verify that making a blocking task into a recurring task breaks dependencies # TODO"
"not ok 18 - dependencies.t: Check that an ID range can be used for deps # TODO"
187.23s
0.00% 0/0
0.05s
0.00% 0/0
0.09s
2019-01-02T00:44:39Z
  07c21e79 Locked
  Tomas Babej
0.00% 0/0
0.17s
99.64% 3876/3890
W T
"/tmp/taskwarrior.07c21e79adc3ade1d8e7b734db307870500ff0b7/taskwarrior.git/src/Variant.cpp:1113:7: warning: this statement may fall through [-Wimplicit-fallthrough=]"
"/tmp/taskwarrior.07c21e79adc3ade1d8e7b734db307870500ff0b7/taskwarrior.git/src/recur2.cpp:47:13: warning: \u2018Task upgradeTask(const Task&)\u2019 defined but not used [-Wunused-function]"
"not ok 1 - diag.t: Task diag output, so we can monitor platforms"
"not ok 7 - dependencies.t: 697: Verify that making a blocking task into a recurring task breaks dependencies # TODO"
"not ok 18 - dependencies.t: Check that an ID range can be used for deps # TODO"
"not ok 2 - hyphenate.t: Verify hyphenation in the absence of white space # TODO"
"not ok 21 - filter.t: filter - description contains +"
"# ERROR: CommandError on file /tmp/taskwarrior.07c21e79adc3ade1d8e7b734db307870500ff0b7/taskwarrior.git/test/filter.t line 673 in test_filter_plus_in_descriptions: 'code, out, err = self.t(\"all description.contains:'foobar\\\\+'\")':"
"not ok 24 - filter.t: 1630: Verify that 'due.before:9d' is correctly interpreted"
"# ERROR: CommandError on file /tmp/taskwarrior.07c21e79adc3ade1d8e7b734db307870500ff0b7/taskwarrior.git/test/filter.t line 979 in test_attribute_modifier_with_duration: 'code, out, err = self.t(\"due.before:9d list rc.verbose:nothing\")':"
"not ok 25 - filter.t: 1630: Verify that 'due:7d' is correctly interpreted"
"# ERROR: CommandError on file /tmp/taskwarrior.07c21e79adc3ade1d8e7b734db307870500ff0b7/taskwarrior.git/test/filter.t line 986 in test_attribute_no_modifier_with_duration: 'code, out, err = self.t(\"due:7d list rc.verbose:nothing\")':"
"not ok 29 - filter.t: 1915: Make sure parser handles complex and-or queries correctly (4)"
"# ERROR: CommandError on file /tmp/taskwarrior.07c21e79adc3ade1d8e7b734db307870500ff0b7/taskwarrior.git/test/filter.t line 1069 in test_complex_and_or_query_variant_four: 'code, out, err = self.t(\"rc.verbose:nothing 'status:pending and ( project:A or project:B )' all\")':"
"not ok 33 - filter.t: 1915: Make sure parser handles complex and-or queries correctly (3)"
"# ERROR: CommandError on file /tmp/taskwarrior.07c21e79adc3ade1d8e7b734db307870500ff0b7/taskwarrior.git/test/filter.t line 1062 in test_complex_and_or_query_variant_three: 'code, out, err = self.t(\"rc.verbose:nothing 'status:pending and (project:A or project:B)' all\")':"
"not ok 5 - project.t: 1455: Test project:school)"
"# ERROR: CommandError on file /tmp/taskwarrior.07c21e79adc3ade1d8e7b734db307870500ff0b7/taskwarrior.git/test/project.t line 391 in test_project_hierarchy_filter: 'code, out, err = self.t(\"project:two) list\")':"
"not ok 6 - project.t: 1511: Test project:one-two can be added and queried"
"# ERROR: CommandError on file /tmp/taskwarrior.07c21e79adc3ade1d8e7b734db307870500ff0b7/taskwarrior.git/test/project.t line 375 in test_project_hierarchy_filter: 'code, out, err = self.t(\"project:two-three list\")':"
"not ok 7 - project.t: 1617: Verify search for multi-word project"
"# ERROR: CommandError on file /tmp/taskwarrior.07c21e79adc3ade1d8e7b734db307870500ff0b7/taskwarrior.git/test/project.t line 466 in test_multi_word_project: 'code, out, err = self.t(\"project:'three four' list\")':"
"not ok 11 - project.t: 555: log with a project causes a segfault"
"not ok 20 - search.t: 1479: Verify that a description of 'one two' is searchable"
"# ERROR: CommandError on file /tmp/taskwarrior.07c21e79adc3ade1d8e7b734db307870500ff0b7/taskwarrior.git/test/search.t line 257 in test_description_with_spaces: 'code, out, err = self.t(\"description:one\\ two list\")':"
226.21s
0.00% 0/0
0.09s
99.61% 3875/3890
W T
"/tmp/taskwarrior.07c21e79adc3ade1d8e7b734db307870500ff0b7/taskwarrior.git/src/Variant.cpp:1113:7: warning: this statement may fall through [-Wimplicit-fallthrough=]"
"/tmp/taskwarrior.07c21e79adc3ade1d8e7b734db307870500ff0b7/taskwarrior.git/src/recur2.cpp:47:13: warning: \u2018Task upgradeTask(const Task&)\u2019 defined but not used [-Wunused-function]"
"not ok 1 - diag.t: Task diag output, so we can monitor platforms"
"not ok 5 - project.t: 1455: Test project:school)"
"# ERROR: CommandError on file /tmp/taskwarrior.07c21e79adc3ade1d8e7b734db307870500ff0b7/taskwarrior.git/test/project.t line 391 in test_project_hierarchy_filter: 'code, out, err = self.t(\"project:two) list\")':"
"not ok 6 - project.t: 1511: Test project:one-two can be added and queried"
"# ERROR: CommandError on file /tmp/taskwarrior.07c21e79adc3ade1d8e7b734db307870500ff0b7/taskwarrior.git/test/project.t line 375 in test_project_hierarchy_filter: 'code, out, err = self.t(\"project:two-three list\")':"
"not ok 7 - project.t: 1617: Verify search for multi-word project"
"# ERROR: CommandError on file /tmp/taskwarrior.07c21e79adc3ade1d8e7b734db307870500ff0b7/taskwarrior.git/test/project.t line 466 in test_multi_word_project: 'code, out, err = self.t(\"project:'three four' list\")':"
"not ok 11 - project.t: 555: log with a project causes a segfault"
"not ok 20 - search.t: 1479: Verify that a description of 'one two' is searchable"
"# ERROR: CommandError on file /tmp/taskwarrior.07c21e79adc3ade1d8e7b734db307870500ff0b7/taskwarrior.git/test/search.t line 257 in test_description_with_spaces: 'code, out, err = self.t(\"description:one\\ two list\")':"
"not ok 2 - hyphenate.t: Verify hyphenation in the absence of white space # TODO"
"not ok 1 - feature.default.project.t: default.project is not applied to projectless tasks during sync"
"# ERROR: CommandError on file /tmp/taskwarrior.07c21e79adc3ade1d8e7b734db307870500ff0b7/taskwarrior.git/test/feature.default.project.t line 246 in test_default_project_sync: 'self.t1(\"sync\")':"
"not ok 21 - filter.t: filter - description contains +"
"# ERROR: CommandError on file /tmp/taskwarrior.07c21e79adc3ade1d8e7b734db307870500ff0b7/taskwarrior.git/test/filter.t line 673 in test_filter_plus_in_descriptions: 'code, out, err = self.t(\"all description.contains:'foobar\\\\+'\")':"
"not ok 24 - filter.t: 1630: Verify that 'due.before:9d' is correctly interpreted"
"# ERROR: CommandError on file /tmp/taskwarrior.07c21e79adc3ade1d8e7b734db307870500ff0b7/taskwarrior.git/test/filter.t line 979 in test_attribute_modifier_with_duration: 'code, out, err = self.t(\"due.before:9d list rc.verbose:nothing\")':"
"not ok 25 - filter.t: 1630: Verify that 'due:7d' is correctly interpreted"
"# ERROR: CommandError on file /tmp/taskwarrior.07c21e79adc3ade1d8e7b734db307870500ff0b7/taskwarrior.git/test/filter.t line 986 in test_attribute_no_modifier_with_duration: 'code, out, err = self.t(\"due:7d list rc.verbose:nothing\")':"
"not ok 29 - filter.t: 1915: Make sure parser handles complex and-or queries correctly (4)"
"# ERROR: CommandError on file /tmp/taskwarrior.07c21e79adc3ade1d8e7b734db307870500ff0b7/taskwarrior.git/test/filter.t line 1069 in test_complex_and_or_query_variant_four: 'code, out, err = self.t(\"rc.verbose:nothing 'status:pending and ( project:A or project:B )' all\")':"
"not ok 33 - filter.t: 1915: Make sure parser handles complex and-or queries correctly (3)"
"# ERROR: CommandError on file /tmp/taskwarrior.07c21e79adc3ade1d8e7b734db307870500ff0b7/taskwarrior.git/test/filter.t line 1062 in test_complex_and_or_query_variant_three: 'code, out, err = self.t(\"rc.verbose:nothing 'status:pending and (project:A or project:B)' all\")':"
"not ok 7 - dependencies.t: 697: Verify that making a blocking task into a recurring task breaks dependencies # TODO"
"not ok 18 - dependencies.t: Check that an ID range can be used for deps # TODO"
187.66s
0.00% 0/0
0.06s
0.00% 0/0
0.28s
2019-01-02T00:44:39Z
  ef3c1bc0 Locked
  Tomas Babej
0.00% 0/0
0.12s
99.64% 3876/3890
W T
"/tmp/taskwarrior.ef3c1bc090e2d4913016a7ab58d59de6ee1e164e/taskwarrior.git/src/Variant.cpp:1113:7: warning: this statement may fall through [-Wimplicit-fallthrough=]"
"/tmp/taskwarrior.ef3c1bc090e2d4913016a7ab58d59de6ee1e164e/taskwarrior.git/src/recur2.cpp:47:13: warning: \u2018Task upgradeTask(const Task&)\u2019 defined but not used [-Wunused-function]"
"not ok 1 - diag.t: Task diag output, so we can monitor platforms"
"not ok 7 - dependencies.t: 697: Verify that making a blocking task into a recurring task breaks dependencies # TODO"
"not ok 18 - dependencies.t: Check that an ID range can be used for deps # TODO"
"not ok 2 - hyphenate.t: Verify hyphenation in the absence of white space # TODO"
"not ok 21 - filter.t: filter - description contains +"
"# ERROR: CommandError on file /tmp/taskwarrior.ef3c1bc090e2d4913016a7ab58d59de6ee1e164e/taskwarrior.git/test/filter.t line 673 in test_filter_plus_in_descriptions: 'code, out, err = self.t(\"all description.contains:'foobar\\\\+'\")':"
"not ok 24 - filter.t: 1630: Verify that 'due.before:9d' is correctly interpreted"
"# ERROR: CommandError on file /tmp/taskwarrior.ef3c1bc090e2d4913016a7ab58d59de6ee1e164e/taskwarrior.git/test/filter.t line 979 in test_attribute_modifier_with_duration: 'code, out, err = self.t(\"due.before:9d list rc.verbose:nothing\")':"
"not ok 25 - filter.t: 1630: Verify that 'due:7d' is correctly interpreted"
"# ERROR: CommandError on file /tmp/taskwarrior.ef3c1bc090e2d4913016a7ab58d59de6ee1e164e/taskwarrior.git/test/filter.t line 986 in test_attribute_no_modifier_with_duration: 'code, out, err = self.t(\"due:7d list rc.verbose:nothing\")':"
"not ok 29 - filter.t: 1915: Make sure parser handles complex and-or queries correctly (4)"
"# ERROR: CommandError on file /tmp/taskwarrior.ef3c1bc090e2d4913016a7ab58d59de6ee1e164e/taskwarrior.git/test/filter.t line 1069 in test_complex_and_or_query_variant_four: 'code, out, err = self.t(\"rc.verbose:nothing 'status:pending and ( project:A or project:B )' all\")':"
"not ok 33 - filter.t: 1915: Make sure parser handles complex and-or queries correctly (3)"
"# ERROR: CommandError on file /tmp/taskwarrior.ef3c1bc090e2d4913016a7ab58d59de6ee1e164e/taskwarrior.git/test/filter.t line 1062 in test_complex_and_or_query_variant_three: 'code, out, err = self.t(\"rc.verbose:nothing 'status:pending and (project:A or project:B)' all\")':"
"not ok 5 - project.t: 1455: Test project:school)"
"# ERROR: CommandError on file /tmp/taskwarrior.ef3c1bc090e2d4913016a7ab58d59de6ee1e164e/taskwarrior.git/test/project.t line 391 in test_project_hierarchy_filter: 'code, out, err = self.t(\"project:two) list\")':"
"not ok 6 - project.t: 1511: Test project:one-two can be added and queried"
"# ERROR: CommandError on file /tmp/taskwarrior.ef3c1bc090e2d4913016a7ab58d59de6ee1e164e/taskwarrior.git/test/project.t line 375 in test_project_hierarchy_filter: 'code, out, err = self.t(\"project:two-three list\")':"
"not ok 7 - project.t: 1617: Verify search for multi-word project"
"# ERROR: CommandError on file /tmp/taskwarrior.ef3c1bc090e2d4913016a7ab58d59de6ee1e164e/taskwarrior.git/test/project.t line 466 in test_multi_word_project: 'code, out, err = self.t(\"project:'three four' list\")':"
"not ok 11 - project.t: 555: log with a project causes a segfault"
"not ok 20 - search.t: 1479: Verify that a description of 'one two' is searchable"
"# ERROR: CommandError on file /tmp/taskwarrior.ef3c1bc090e2d4913016a7ab58d59de6ee1e164e/taskwarrior.git/test/search.t line 257 in test_description_with_spaces: 'code, out, err = self.t(\"description:one\\ two list\")':"
241.13s
0.00% 0/0
0.07s
99.61% 3875/3890
W T
"/tmp/taskwarrior.ef3c1bc090e2d4913016a7ab58d59de6ee1e164e/taskwarrior.git/src/Variant.cpp:1113:7: warning: this statement may fall through [-Wimplicit-fallthrough=]"
"/tmp/taskwarrior.ef3c1bc090e2d4913016a7ab58d59de6ee1e164e/taskwarrior.git/src/recur2.cpp:47:13: warning: \u2018Task upgradeTask(const Task&)\u2019 defined but not used [-Wunused-function]"
"not ok 1 - diag.t: Task diag output, so we can monitor platforms"
"not ok 5 - project.t: 1455: Test project:school)"
"# ERROR: CommandError on file /tmp/taskwarrior.ef3c1bc090e2d4913016a7ab58d59de6ee1e164e/taskwarrior.git/test/project.t line 391 in test_project_hierarchy_filter: 'code, out, err = self.t(\"project:two) list\")':"
"not ok 6 - project.t: 1511: Test project:one-two can be added and queried"
"# ERROR: CommandError on file /tmp/taskwarrior.ef3c1bc090e2d4913016a7ab58d59de6ee1e164e/taskwarrior.git/test/project.t line 375 in test_project_hierarchy_filter: 'code, out, err = self.t(\"project:two-three list\")':"
"not ok 7 - project.t: 1617: Verify search for multi-word project"
"# ERROR: CommandError on file /tmp/taskwarrior.ef3c1bc090e2d4913016a7ab58d59de6ee1e164e/taskwarrior.git/test/project.t line 466 in test_multi_word_project: 'code, out, err = self.t(\"project:'three four' list\")':"
"not ok 11 - project.t: 555: log with a project causes a segfault"
"not ok 20 - search.t: 1479: Verify that a description of 'one two' is searchable"
"# ERROR: CommandError on file /tmp/taskwarrior.ef3c1bc090e2d4913016a7ab58d59de6ee1e164e/taskwarrior.git/test/search.t line 257 in test_description_with_spaces: 'code, out, err = self.t(\"description:one\\ two list\")':"
"not ok 2 - hyphenate.t: Verify hyphenation in the absence of white space # TODO"
"not ok 1 - feature.default.project.t: default.project is not applied to projectless tasks during sync"
"# ERROR: CommandError on file /tmp/taskwarrior.ef3c1bc090e2d4913016a7ab58d59de6ee1e164e/taskwarrior.git/test/feature.default.project.t line 246 in test_default_project_sync: 'self.t1(\"sync\")':"
"not ok 21 - filter.t: filter - description contains +"
"# ERROR: CommandError on file /tmp/taskwarrior.ef3c1bc090e2d4913016a7ab58d59de6ee1e164e/taskwarrior.git/test/filter.t line 673 in test_filter_plus_in_descriptions: 'code, out, err = self.t(\"all description.contains:'foobar\\\\+'\")':"
"not ok 24 - filter.t: 1630: Verify that 'due.before:9d' is correctly interpreted"
"# ERROR: CommandError on file /tmp/taskwarrior.ef3c1bc090e2d4913016a7ab58d59de6ee1e164e/taskwarrior.git/test/filter.t line 979 in test_attribute_modifier_with_duration: 'code, out, err = self.t(\"due.before:9d list rc.verbose:nothing\")':"
"not ok 25 - filter.t: 1630: Verify that 'due:7d' is correctly interpreted"
"# ERROR: CommandError on file /tmp/taskwarrior.ef3c1bc090e2d4913016a7ab58d59de6ee1e164e/taskwarrior.git/test/filter.t line 986 in test_attribute_no_modifier_with_duration: 'code, out, err = self.t(\"due:7d list rc.verbose:nothing\")':"
"not ok 29 - filter.t: 1915: Make sure parser handles complex and-or queries correctly (4)"
"# ERROR: CommandError on file /tmp/taskwarrior.ef3c1bc090e2d4913016a7ab58d59de6ee1e164e/taskwarrior.git/test/filter.t line 1069 in test_complex_and_or_query_variant_four: 'code, out, err = self.t(\"rc.verbose:nothing 'status:pending and ( project:A or project:B )' all\")':"
"not ok 33 - filter.t: 1915: Make sure parser handles complex and-or queries correctly (3)"
"# ERROR: CommandError on file /tmp/taskwarrior.ef3c1bc090e2d4913016a7ab58d59de6ee1e164e/taskwarrior.git/test/filter.t line 1062 in test_complex_and_or_query_variant_three: 'code, out, err = self.t(\"rc.verbose:nothing 'status:pending and (project:A or project:B)' all\")':"
"not ok 7 - dependencies.t: 697: Verify that making a blocking task into a recurring task breaks dependencies # TODO"
"not ok 18 - dependencies.t: Check that an ID range can be used for deps # TODO"
187.33s
0.00% 0/0
0.03s
0.00% 0/0
0.08s

55 commits not shown.