Flod  FLOD Testing | taskwarrior 2.5.2

Arch 2016
64-bit
GCC 6.2.1
CMake 3.6.2
Python 3.5.2
CentOS 7
64-bit
GCC 4.8.5
CMake 3.10.1
Python 2.7.5
Debian Stable
64-bit
GCC 6.3.0
CMake 3.7.2
Python 2.7.13
Fedora 27
64-bit
GCC 7.2.1
CMake 3.10.1
Python 2.7.14
macOS 10.13 High Sierra
64-bit
Clang 900
CMake 3.9.4
Python 2.7.10
Ubuntu 16.10
64-bit
GCC 6.2.0
CMake 3.5.2
Python 2.7.12
2018-08-19T13:21:27Z
  78033ea2
  Alexandre Provencio
0.00% 0/0
0.44s
0.00% 0/0
0.44s
0.00% 0/0
0.02s
0.00% 0/0
0.37s
2018-06-03T18:16:35Z
  08d985f4 Locked
  Vladimir Shulyak
0.00% 0/0
0.14s
0.00% 0/0
W E
"/tmp/taskwarrior.08d985f40cab9361055d4d5287f105ea31f7a8e7/taskwarrior.git/src/Variant.cpp:1113:7: warning: this statement may fall through [-Wimplicit-fallthrough=]"
"collect2: error: ld returned 1 exit status"
172.32s
0.00% 0/0
0.20s
0.00% 0/0
W E
"/tmp/taskwarrior.08d985f40cab9361055d4d5287f105ea31f7a8e7/taskwarrior.git/src/Variant.cpp:1113:7: warning: this statement may fall through [-Wimplicit-fallthrough=]"
"collect2: error: ld returned 1 exit status"
173.66s
0.00% 0/0
0.02s
0.00% 0/0
0.21s
2018-05-26T14:00:05Z
  376d3365 Locked
  Paul Beckingham
0.00% 0/0
0.19s
0.00% 0/0
W E
"/tmp/taskwarrior.376d3365251e0870aba4b8c5d994876a283904b1/taskwarrior.git/src/Variant.cpp:1113:7: warning: this statement may fall through [-Wimplicit-fallthrough=]"
"collect2: error: ld returned 1 exit status"
174.56s
0.00% 0/0
0.25s
0.00% 0/0
W E
"/tmp/taskwarrior.376d3365251e0870aba4b8c5d994876a283904b1/taskwarrior.git/src/Variant.cpp:1113:7: warning: this statement may fall through [-Wimplicit-fallthrough=]"
"collect2: error: ld returned 1 exit status"
156.80s
0.00% 0/0
0.06s
0.00% 0/0
0.18s
2018-05-26T13:50:50Z
  edfa8ed4 Locked
  Paul Beckingham
0.00% 0/0
0.24s
0.00% 0/0
W E
"/tmp/taskwarrior.edfa8ed4eaa898e2b93a66e213d8760715d38445/taskwarrior.git/src/Variant.cpp:1113:7: warning: this statement may fall through [-Wimplicit-fallthrough=]"
"collect2: error: ld returned 1 exit status"
180.84s
0.00% 0/0
0.21s
0.00% 0/0
W E
"/tmp/taskwarrior.edfa8ed4eaa898e2b93a66e213d8760715d38445/taskwarrior.git/src/Variant.cpp:1113:7: warning: this statement may fall through [-Wimplicit-fallthrough=]"
"collect2: error: ld returned 1 exit status"
162.47s
0.00% 0/0
0.02s
0.00% 0/0
0.20s
2018-05-14T05:12:19Z
  09f9b9e6 Locked
  Paul Beckingham
0.00% 0/0
0.04s
0.00% 0/0
W E
"/tmp/taskwarrior.09f9b9e625bac6d14e3134bc90bbef79dd84b295/taskwarrior.git/src/Variant.cpp:1113:7: warning: this statement may fall through [-Wimplicit-fallthrough=]"
"collect2: error: ld returned 1 exit status"
187.06s
0.00% 0/0
0.05s
0.00% 0/0
W E
"/tmp/taskwarrior.09f9b9e625bac6d14e3134bc90bbef79dd84b295/taskwarrior.git/src/Variant.cpp:1113:7: warning: this statement may fall through [-Wimplicit-fallthrough=]"
"collect2: error: ld returned 1 exit status"
175.20s
0.00% 0/0
0.04s
0.00% 0/0
0.05s
2018-05-14T05:04:59Z
  27055ea1 Locked
  Paul Beckingham
0.00% 0/0
0.09s
0.00% 0/0
W E
"/tmp/taskwarrior.27055ea1b9116f1cefeb5d314119dc8b0aa0965f/taskwarrior.git/src/Variant.cpp:1113:7: warning: this statement may fall through [-Wimplicit-fallthrough=]"
"/tmp/taskwarrior.27055ea1b9116f1cefeb5d314119dc8b0aa0965f/taskwarrior.git/src/recur.cpp:142:9: error: \u2018context\u2019 was not declared in this scope"
"/tmp/taskwarrior.27055ea1b9116f1cefeb5d314119dc8b0aa0965f/taskwarrior.git/src/recur.cpp:142:9: error: \u2018context\u2019 was not declared in this scope"
64.83s
0.00% 0/0
0.09s
0.00% 0/0
W E
"/tmp/taskwarrior.27055ea1b9116f1cefeb5d314119dc8b0aa0965f/taskwarrior.git/src/Variant.cpp:1113:7: warning: this statement may fall through [-Wimplicit-fallthrough=]"
"/tmp/taskwarrior.27055ea1b9116f1cefeb5d314119dc8b0aa0965f/taskwarrior.git/src/recur.cpp:142:9: error: \u2018context\u2019 was not declared in this scope"
"/tmp/taskwarrior.27055ea1b9116f1cefeb5d314119dc8b0aa0965f/taskwarrior.git/src/recur.cpp:142:9: error: \u2018context\u2019 was not declared in this scope"
63.45s
0.00% 0/0
0.05s
0.00% 0/0
0.07s
2018-05-14T05:04:45Z
  9fefe4a3 Locked
  Paul Beckingham
0.00% 0/0
0.08s
0.00% 0/0
W E
"/tmp/taskwarrior.9fefe4a3788be3cf2b96e824a137c9a60ae7bbe7/taskwarrior.git/src/Variant.cpp:1113:7: warning: this statement may fall through [-Wimplicit-fallthrough=]"
"/tmp/taskwarrior.9fefe4a3788be3cf2b96e824a137c9a60ae7bbe7/taskwarrior.git/src/recur.cpp:142:9: error: \u2018context\u2019 was not declared in this scope"
"/tmp/taskwarrior.9fefe4a3788be3cf2b96e824a137c9a60ae7bbe7/taskwarrior.git/src/recur.cpp:142:9: error: \u2018context\u2019 was not declared in this scope"
74.19s
0.00% 0/0
0.08s
0.00% 0/0
W E
"/tmp/taskwarrior.9fefe4a3788be3cf2b96e824a137c9a60ae7bbe7/taskwarrior.git/src/Variant.cpp:1113:7: warning: this statement may fall through [-Wimplicit-fallthrough=]"
"/tmp/taskwarrior.9fefe4a3788be3cf2b96e824a137c9a60ae7bbe7/taskwarrior.git/src/recur.cpp:142:9: error: \u2018context\u2019 was not declared in this scope"
"/tmp/taskwarrior.9fefe4a3788be3cf2b96e824a137c9a60ae7bbe7/taskwarrior.git/src/recur.cpp:142:9: error: \u2018context\u2019 was not declared in this scope"
67.70s
0.00% 0/0
0.05s
0.00% 0/0
0.07s
2018-05-14T05:04:35Z
  c5ac2e2d Locked
  Simon Ruderich
0.00% 0/0
0.12s
0.00% 0/0
W E
"/tmp/taskwarrior.c5ac2e2d0076ef768be7cad5b165e55131348b60/taskwarrior.git/src/Variant.cpp:1113:7: warning: this statement may fall through [-Wimplicit-fallthrough=]"
"/tmp/taskwarrior.c5ac2e2d0076ef768be7cad5b165e55131348b60/taskwarrior.git/src/recur.cpp:142:9: error: \u2018context\u2019 was not declared in this scope"
"/tmp/taskwarrior.c5ac2e2d0076ef768be7cad5b165e55131348b60/taskwarrior.git/src/recur.cpp:142:9: error: \u2018context\u2019 was not declared in this scope"
63.52s
0.00% 0/0
0.13s
0.00% 0/0
W E
"/tmp/taskwarrior.c5ac2e2d0076ef768be7cad5b165e55131348b60/taskwarrior.git/src/Variant.cpp:1113:7: warning: this statement may fall through [-Wimplicit-fallthrough=]"
"/tmp/taskwarrior.c5ac2e2d0076ef768be7cad5b165e55131348b60/taskwarrior.git/src/recur.cpp:142:9: error: \u2018context\u2019 was not declared in this scope"
"/tmp/taskwarrior.c5ac2e2d0076ef768be7cad5b165e55131348b60/taskwarrior.git/src/recur.cpp:142:9: error: \u2018context\u2019 was not declared in this scope"
65.69s
0.00% 0/0
0.05s
0.00% 0/0
0.09s
2018-05-14T05:04:26Z
  75ad38f2 Locked
  Paul Beckingham
0.00% 0/0
0.09s
0.00% 0/0
W E
"/tmp/taskwarrior.75ad38f2445887fee1c683405c5e968c5b08b7e2/taskwarrior.git/src/Variant.cpp:1113:7: warning: this statement may fall through [-Wimplicit-fallthrough=]"
"/tmp/taskwarrior.75ad38f2445887fee1c683405c5e968c5b08b7e2/taskwarrior.git/src/recur.cpp:142:9: error: \u2018context\u2019 was not declared in this scope"
"/tmp/taskwarrior.75ad38f2445887fee1c683405c5e968c5b08b7e2/taskwarrior.git/src/recur.cpp:142:9: error: \u2018context\u2019 was not declared in this scope"
64.35s
0.00% 0/0
0.13s
0.00% 0/0
W E
"/tmp/taskwarrior.75ad38f2445887fee1c683405c5e968c5b08b7e2/taskwarrior.git/src/Variant.cpp:1113:7: warning: this statement may fall through [-Wimplicit-fallthrough=]"
"/tmp/taskwarrior.75ad38f2445887fee1c683405c5e968c5b08b7e2/taskwarrior.git/src/recur.cpp:142:9: error: \u2018context\u2019 was not declared in this scope"
"/tmp/taskwarrior.75ad38f2445887fee1c683405c5e968c5b08b7e2/taskwarrior.git/src/recur.cpp:142:9: error: \u2018context\u2019 was not declared in this scope"
66.76s
0.00% 0/0
0.05s
0.00% 0/0
0.10s
2018-05-14T05:04:15Z
  1133f02d Locked
  Paul Beckingham
0.00% 0/0
0.07s
0.00% 0/0
W E
"/tmp/taskwarrior.1133f02df7551df39fed796772c8cda400908a56/taskwarrior.git/src/Variant.cpp:1113:7: warning: this statement may fall through [-Wimplicit-fallthrough=]"
"/tmp/taskwarrior.1133f02df7551df39fed796772c8cda400908a56/taskwarrior.git/src/recur.cpp:142:9: error: \u2018context\u2019 was not declared in this scope"
"/tmp/taskwarrior.1133f02df7551df39fed796772c8cda400908a56/taskwarrior.git/src/recur.cpp:142:9: error: \u2018context\u2019 was not declared in this scope"
63.04s
0.00% 0/0
0.08s
0.00% 0/0
W E
"/tmp/taskwarrior.1133f02df7551df39fed796772c8cda400908a56/taskwarrior.git/src/Variant.cpp:1113:7: warning: this statement may fall through [-Wimplicit-fallthrough=]"
"/tmp/taskwarrior.1133f02df7551df39fed796772c8cda400908a56/taskwarrior.git/src/recur.cpp:142:9: error: \u2018context\u2019 was not declared in this scope"
"/tmp/taskwarrior.1133f02df7551df39fed796772c8cda400908a56/taskwarrior.git/src/recur.cpp:142:9: error: \u2018context\u2019 was not declared in this scope"
66.46s
0.00% 0/0
0.05s
0.00% 0/0
0.11s
2018-05-14T05:04:02Z
  ce924349 Locked
  Paul Beckingham
0.00% 0/0
0.08s
0.00% 0/0
W E
"/tmp/taskwarrior.ce924349c182bb93f6c2e8324a22cf3ae1659008/taskwarrior.git/src/Variant.cpp:1113:7: warning: this statement may fall through [-Wimplicit-fallthrough=]"
"/tmp/taskwarrior.ce924349c182bb93f6c2e8324a22cf3ae1659008/taskwarrior.git/src/recur.cpp:142:9: error: \u2018context\u2019 was not declared in this scope"
"/tmp/taskwarrior.ce924349c182bb93f6c2e8324a22cf3ae1659008/taskwarrior.git/src/recur.cpp:142:9: error: \u2018context\u2019 was not declared in this scope"
64.06s
0.00% 0/0
0.07s
0.00% 0/0
W E
"/tmp/taskwarrior.ce924349c182bb93f6c2e8324a22cf3ae1659008/taskwarrior.git/src/Variant.cpp:1113:7: warning: this statement may fall through [-Wimplicit-fallthrough=]"
"/tmp/taskwarrior.ce924349c182bb93f6c2e8324a22cf3ae1659008/taskwarrior.git/src/recur.cpp:142:9: error: \u2018context\u2019 was not declared in this scope"
"/tmp/taskwarrior.ce924349c182bb93f6c2e8324a22cf3ae1659008/taskwarrior.git/src/recur.cpp:142:9: error: \u2018context\u2019 was not declared in this scope"
65.27s
0.00% 0/0
0.05s
0.00% 0/0
0.11s
2018-05-14T05:03:54Z
  24a68b2a Locked
  Paul Beckingham
0.00% 0/0
0.05s
0.00% 0/0
W E
"/tmp/taskwarrior.24a68b2ad8b8a826b8396d12de3e26e8b8200f1b/taskwarrior.git/src/Variant.cpp:1113:7: warning: this statement may fall through [-Wimplicit-fallthrough=]"
"/tmp/taskwarrior.24a68b2ad8b8a826b8396d12de3e26e8b8200f1b/taskwarrior.git/src/recur.cpp:142:9: error: \u2018context\u2019 was not declared in this scope"
"/tmp/taskwarrior.24a68b2ad8b8a826b8396d12de3e26e8b8200f1b/taskwarrior.git/src/recur.cpp:142:9: error: \u2018context\u2019 was not declared in this scope"
63.17s
0.00% 0/0
0.09s
0.00% 0/0
W E
"/tmp/taskwarrior.24a68b2ad8b8a826b8396d12de3e26e8b8200f1b/taskwarrior.git/src/Variant.cpp:1113:7: warning: this statement may fall through [-Wimplicit-fallthrough=]"
"/tmp/taskwarrior.24a68b2ad8b8a826b8396d12de3e26e8b8200f1b/taskwarrior.git/src/recur.cpp:142:9: error: \u2018context\u2019 was not declared in this scope"
"/tmp/taskwarrior.24a68b2ad8b8a826b8396d12de3e26e8b8200f1b/taskwarrior.git/src/recur.cpp:142:9: error: \u2018context\u2019 was not declared in this scope"
63.57s
0.00% 0/0
0.05s
0.00% 0/0
0.09s
2018-05-14T05:03:31Z
  06521a1b Locked
  Kirill Bobyrev
0.00% 0/0
0.06s
0.00% 0/0
W E
"/tmp/taskwarrior.06521a1b55193883f951388d0ccd3e82d1590f78/taskwarrior.git/src/Variant.cpp:1113:7: warning: this statement may fall through [-Wimplicit-fallthrough=]"
"/tmp/taskwarrior.06521a1b55193883f951388d0ccd3e82d1590f78/taskwarrior.git/src/recur.cpp:142:9: error: \u2018context\u2019 was not declared in this scope"
"/tmp/taskwarrior.06521a1b55193883f951388d0ccd3e82d1590f78/taskwarrior.git/src/recur.cpp:142:9: error: \u2018context\u2019 was not declared in this scope"
64.76s
0.00% 0/0
0.05s
0.00% 0/0
W E
"/tmp/taskwarrior.06521a1b55193883f951388d0ccd3e82d1590f78/taskwarrior.git/src/Variant.cpp:1113:7: warning: this statement may fall through [-Wimplicit-fallthrough=]"
"/tmp/taskwarrior.06521a1b55193883f951388d0ccd3e82d1590f78/taskwarrior.git/src/recur.cpp:142:9: error: \u2018context\u2019 was not declared in this scope"
"/tmp/taskwarrior.06521a1b55193883f951388d0ccd3e82d1590f78/taskwarrior.git/src/recur.cpp:142:9: error: \u2018context\u2019 was not declared in this scope"
69.76s
0.00% 0/0
0.05s
0.00% 0/0
0.03s
2018-05-14T05:03:17Z
  3594e188 Locked
  Paul Beckingham
0.00% 0/0
0.08s
0.00% 0/0
W E
"/tmp/taskwarrior.3594e1886f3c837ca2c45ab475bb8eb057c61303/taskwarrior.git/src/Variant.cpp:1113:7: warning: this statement may fall through [-Wimplicit-fallthrough=]"
"/tmp/taskwarrior.3594e1886f3c837ca2c45ab475bb8eb057c61303/taskwarrior.git/src/recur.cpp:142:9: error: \u2018context\u2019 was not declared in this scope"
"/tmp/taskwarrior.3594e1886f3c837ca2c45ab475bb8eb057c61303/taskwarrior.git/src/recur.cpp:142:9: error: \u2018context\u2019 was not declared in this scope"
61.28s
0.00% 0/0
0.10s
0.00% 0/0
0.43s
0.00% 0/0
0.05s
0.00% 0/0
0.11s
2018-05-14T05:03:08Z
  aacf75d4 Locked
  Paul Beckingham
0.00% 0/0
0.03s
0.00% 0/0
W E
"/tmp/taskwarrior.aacf75d4145473a8eea18a2e8fc2f07fbef58473/taskwarrior.git/src/Variant.cpp:1113:7: warning: this statement may fall through [-Wimplicit-fallthrough=]"
"/tmp/taskwarrior.aacf75d4145473a8eea18a2e8fc2f07fbef58473/taskwarrior.git/src/recur.cpp:142:9: error: \u2018context\u2019 was not declared in this scope"
"/tmp/taskwarrior.aacf75d4145473a8eea18a2e8fc2f07fbef58473/taskwarrior.git/src/recur.cpp:142:9: error: \u2018context\u2019 was not declared in this scope"
63.04s
0.00% 0/0
0.09s
0.00% 0/0
W E
"/tmp/taskwarrior.aacf75d4145473a8eea18a2e8fc2f07fbef58473/taskwarrior.git/src/Variant.cpp:1113:7: warning: this statement may fall through [-Wimplicit-fallthrough=]"
"/tmp/taskwarrior.aacf75d4145473a8eea18a2e8fc2f07fbef58473/taskwarrior.git/src/recur.cpp:142:9: error: \u2018context\u2019 was not declared in this scope"
"/tmp/taskwarrior.aacf75d4145473a8eea18a2e8fc2f07fbef58473/taskwarrior.git/src/recur.cpp:142:9: error: \u2018context\u2019 was not declared in this scope"
62.02s
0.00% 0/0
0.05s
0.00% 0/0
0.09s
2018-05-14T05:02:57Z
  511a2352 Locked
  Kirill Bobyrev
0.00% 0/0
0.04s
0.00% 0/0
W E
"/tmp/taskwarrior.511a23521522aa05bc990ee9d8d022e74b7bfcf7/taskwarrior.git/src/Variant.cpp:1113:7: warning: this statement may fall through [-Wimplicit-fallthrough=]"
"/tmp/taskwarrior.511a23521522aa05bc990ee9d8d022e74b7bfcf7/taskwarrior.git/src/recur.cpp:142:9: error: \u2018context\u2019 was not declared in this scope"
"/tmp/taskwarrior.511a23521522aa05bc990ee9d8d022e74b7bfcf7/taskwarrior.git/src/recur.cpp:142:9: error: \u2018context\u2019 was not declared in this scope"
65.60s
0.00% 0/0
0.05s
0.00% 0/0
W E
"/tmp/taskwarrior.511a23521522aa05bc990ee9d8d022e74b7bfcf7/taskwarrior.git/src/Variant.cpp:1113:7: warning: this statement may fall through [-Wimplicit-fallthrough=]"
"/tmp/taskwarrior.511a23521522aa05bc990ee9d8d022e74b7bfcf7/taskwarrior.git/src/recur.cpp:142:9: error: \u2018context\u2019 was not declared in this scope"
"/tmp/taskwarrior.511a23521522aa05bc990ee9d8d022e74b7bfcf7/taskwarrior.git/src/recur.cpp:142:9: error: \u2018context\u2019 was not declared in this scope"
60.24s
0.00% 0/0
0.05s
0.00% 0/0
0.07s
2018-05-14T05:02:24Z
  6f19a3fb Locked
  Simon Ruderich
0.00% 0/0
0.08s
0.00% 0/0
W E
"/tmp/taskwarrior.6f19a3fbae79091ab1526532b59da002bb6eb1e6/taskwarrior.git/src/Variant.cpp:1113:7: warning: this statement may fall through [-Wimplicit-fallthrough=]"
"/tmp/taskwarrior.6f19a3fbae79091ab1526532b59da002bb6eb1e6/taskwarrior.git/src/recur.cpp:142:9: error: \u2018context\u2019 was not declared in this scope"
"/tmp/taskwarrior.6f19a3fbae79091ab1526532b59da002bb6eb1e6/taskwarrior.git/src/recur.cpp:142:9: error: \u2018context\u2019 was not declared in this scope"
63.14s
0.00% 0/0
0.06s
0.00% 0/0
W E
"/tmp/taskwarrior.6f19a3fbae79091ab1526532b59da002bb6eb1e6/taskwarrior.git/src/Variant.cpp:1113:7: warning: this statement may fall through [-Wimplicit-fallthrough=]"
"/tmp/taskwarrior.6f19a3fbae79091ab1526532b59da002bb6eb1e6/taskwarrior.git/src/recur.cpp:142:9: error: \u2018context\u2019 was not declared in this scope"
"/tmp/taskwarrior.6f19a3fbae79091ab1526532b59da002bb6eb1e6/taskwarrior.git/src/recur.cpp:142:9: error: \u2018context\u2019 was not declared in this scope"
71.42s
0.00% 0/0
0.06s
0.00% 0/0
0.08s
2018-05-14T05:02:16Z
  c6267c52 Locked
  Simon Ruderich
0.00% 0/0
0.07s
0.00% 0/0
W E
"/tmp/taskwarrior.c6267c526d501a728cb3455daffad0fb3a396a53/taskwarrior.git/src/Variant.cpp:1113:7: warning: this statement may fall through [-Wimplicit-fallthrough=]"
"/tmp/taskwarrior.c6267c526d501a728cb3455daffad0fb3a396a53/taskwarrior.git/src/recur.cpp:142:9: error: \u2018context\u2019 was not declared in this scope"
"/tmp/taskwarrior.c6267c526d501a728cb3455daffad0fb3a396a53/taskwarrior.git/src/recur.cpp:142:9: error: \u2018context\u2019 was not declared in this scope"
63.85s
0.00% 0/0
0.13s
0.00% 0/0
W E
"/tmp/taskwarrior.c6267c526d501a728cb3455daffad0fb3a396a53/taskwarrior.git/src/Variant.cpp:1113:7: warning: this statement may fall through [-Wimplicit-fallthrough=]"
"/tmp/taskwarrior.c6267c526d501a728cb3455daffad0fb3a396a53/taskwarrior.git/src/recur.cpp:142:9: error: \u2018context\u2019 was not declared in this scope"
"/tmp/taskwarrior.c6267c526d501a728cb3455daffad0fb3a396a53/taskwarrior.git/src/recur.cpp:142:9: error: \u2018context\u2019 was not declared in this scope"
66.77s
0.00% 0/0
0.08s
0.00% 0/0
0.10s
2018-05-14T05:02:07Z
  90cc2a44 Locked
  Simon Ruderich
0.00% 0/0
0.07s
0.00% 0/0
W E
"/tmp/taskwarrior.90cc2a441d7527c8cd35f550821e355b4b9a5da1/taskwarrior.git/src/Variant.cpp:1113:7: warning: this statement may fall through [-Wimplicit-fallthrough=]"
"/tmp/taskwarrior.90cc2a441d7527c8cd35f550821e355b4b9a5da1/taskwarrior.git/src/recur.cpp:142:9: error: \u2018context\u2019 was not declared in this scope"
"/tmp/taskwarrior.90cc2a441d7527c8cd35f550821e355b4b9a5da1/taskwarrior.git/src/recur.cpp:142:9: error: \u2018context\u2019 was not declared in this scope"
65.95s
0.00% 0/0
0.10s
0.00% 0/0
W E
"/tmp/taskwarrior.90cc2a441d7527c8cd35f550821e355b4b9a5da1/taskwarrior.git/src/Variant.cpp:1113:7: warning: this statement may fall through [-Wimplicit-fallthrough=]"
"/tmp/taskwarrior.90cc2a441d7527c8cd35f550821e355b4b9a5da1/taskwarrior.git/src/recur.cpp:142:9: error: \u2018context\u2019 was not declared in this scope"
"/tmp/taskwarrior.90cc2a441d7527c8cd35f550821e355b4b9a5da1/taskwarrior.git/src/recur.cpp:142:9: error: \u2018context\u2019 was not declared in this scope"
62.41s
0.00% 0/0
0.10s
0.00% 0/0
0.12s
2018-05-14T05:01:51Z
  286fca39 Locked
  Simon Ruderich
0.00% 0/0
0.13s
0.00% 0/0
W E
"/tmp/taskwarrior.286fca39351f669e10886dd5a1a9d8e80f32d4f2/taskwarrior.git/src/Variant.cpp:1113:7: warning: this statement may fall through [-Wimplicit-fallthrough=]"
"/tmp/taskwarrior.286fca39351f669e10886dd5a1a9d8e80f32d4f2/taskwarrior.git/src/recur.cpp:142:9: error: \u2018context\u2019 was not declared in this scope"
"/tmp/taskwarrior.286fca39351f669e10886dd5a1a9d8e80f32d4f2/taskwarrior.git/src/recur.cpp:142:9: error: \u2018context\u2019 was not declared in this scope"
66.25s
0.00% 0/0
0.08s
0.00% 0/0
W E
"/tmp/taskwarrior.286fca39351f669e10886dd5a1a9d8e80f32d4f2/taskwarrior.git/src/Variant.cpp:1113:7: warning: this statement may fall through [-Wimplicit-fallthrough=]"
"/tmp/taskwarrior.286fca39351f669e10886dd5a1a9d8e80f32d4f2/taskwarrior.git/src/recur.cpp:142:9: error: \u2018context\u2019 was not declared in this scope"
"/tmp/taskwarrior.286fca39351f669e10886dd5a1a9d8e80f32d4f2/taskwarrior.git/src/recur.cpp:142:9: error: \u2018context\u2019 was not declared in this scope"
61.63s
0.00% 0/0
0.09s
0.00% 0/0
0.11s
2018-05-14T05:01:42Z
  9bfc8c2f Locked
  Paul Beckingham
0.00% 0/0
0.08s
0.00% 0/0
W E
"/tmp/taskwarrior.9bfc8c2ff66946e40721f7ff36ef7747cbe7beb9/taskwarrior.git/src/Variant.cpp:1113:7: warning: this statement may fall through [-Wimplicit-fallthrough=]"
"/tmp/taskwarrior.9bfc8c2ff66946e40721f7ff36ef7747cbe7beb9/taskwarrior.git/src/recur.cpp:142:9: error: \u2018context\u2019 was not declared in this scope"
"/tmp/taskwarrior.9bfc8c2ff66946e40721f7ff36ef7747cbe7beb9/taskwarrior.git/src/recur.cpp:142:9: error: \u2018context\u2019 was not declared in this scope"
64.61s
0.00% 0/0
0.09s
0.00% 0/0
W E
"/tmp/taskwarrior.9bfc8c2ff66946e40721f7ff36ef7747cbe7beb9/taskwarrior.git/src/Variant.cpp:1113:7: warning: this statement may fall through [-Wimplicit-fallthrough=]"
"/tmp/taskwarrior.9bfc8c2ff66946e40721f7ff36ef7747cbe7beb9/taskwarrior.git/src/recur.cpp:142:9: error: \u2018context\u2019 was not declared in this scope"
"/tmp/taskwarrior.9bfc8c2ff66946e40721f7ff36ef7747cbe7beb9/taskwarrior.git/src/recur.cpp:142:9: error: \u2018context\u2019 was not declared in this scope"
63.87s
0.00% 0/0
0.07s
0.00% 0/0
0.09s
2018-05-14T05:01:32Z
  e3dab66a Locked
  Paul Beckingham
0.00% 0/0
0.07s
0.00% 0/0
W E
"/tmp/taskwarrior.e3dab66ad1a26943a96d5e00d3d45368533e7b61/taskwarrior.git/src/Variant.cpp:1113:7: warning: this statement may fall through [-Wimplicit-fallthrough=]"
"/tmp/taskwarrior.e3dab66ad1a26943a96d5e00d3d45368533e7b61/taskwarrior.git/src/recur.cpp:142:9: error: \u2018context\u2019 was not declared in this scope"
"/tmp/taskwarrior.e3dab66ad1a26943a96d5e00d3d45368533e7b61/taskwarrior.git/src/recur.cpp:142:9: error: \u2018context\u2019 was not declared in this scope"
65.73s
0.00% 0/0
0.08s
0.00% 0/0
W E
"/tmp/taskwarrior.e3dab66ad1a26943a96d5e00d3d45368533e7b61/taskwarrior.git/src/Variant.cpp:1113:7: warning: this statement may fall through [-Wimplicit-fallthrough=]"
"/tmp/taskwarrior.e3dab66ad1a26943a96d5e00d3d45368533e7b61/taskwarrior.git/src/recur.cpp:142:9: error: \u2018context\u2019 was not declared in this scope"
"/tmp/taskwarrior.e3dab66ad1a26943a96d5e00d3d45368533e7b61/taskwarrior.git/src/recur.cpp:142:9: error: \u2018context\u2019 was not declared in this scope"
67.44s
0.00% 0/0
0.08s
0.00% 0/0
0.11s
2018-05-14T05:01:22Z
  eabda340 Locked
  Simon Ruderich
0.00% 0/0
0.07s
0.00% 0/0
W E
"/tmp/taskwarrior.eabda340ef8af2bc334a14ca188c4df87f39cbec/taskwarrior.git/src/Variant.cpp:1113:7: warning: this statement may fall through [-Wimplicit-fallthrough=]"
"/tmp/taskwarrior.eabda340ef8af2bc334a14ca188c4df87f39cbec/taskwarrior.git/src/recur.cpp:142:9: error: \u2018context\u2019 was not declared in this scope"
"/tmp/taskwarrior.eabda340ef8af2bc334a14ca188c4df87f39cbec/taskwarrior.git/src/recur.cpp:142:9: error: \u2018context\u2019 was not declared in this scope"
64.66s
0.00% 0/0
0.08s
0.00% 0/0
W E
"/tmp/taskwarrior.eabda340ef8af2bc334a14ca188c4df87f39cbec/taskwarrior.git/src/Variant.cpp:1113:7: warning: this statement may fall through [-Wimplicit-fallthrough=]"
"/tmp/taskwarrior.eabda340ef8af2bc334a14ca188c4df87f39cbec/taskwarrior.git/src/recur.cpp:142:9: error: \u2018context\u2019 was not declared in this scope"
"/tmp/taskwarrior.eabda340ef8af2bc334a14ca188c4df87f39cbec/taskwarrior.git/src/recur.cpp:142:9: error: \u2018context\u2019 was not declared in this scope"
64.72s
0.00% 0/0
0.09s
0.00% 0/0
0.10s
2018-05-14T05:01:14Z
  d0bbe2a0 Locked
  Simon Ruderich
0.00% 0/0
0.08s
0.00% 0/0
W E
"/tmp/taskwarrior.d0bbe2a0e82e83e101943a902f6a62517a4f60bf/taskwarrior.git/src/Variant.cpp:1113:7: warning: this statement may fall through [-Wimplicit-fallthrough=]"
"/tmp/taskwarrior.d0bbe2a0e82e83e101943a902f6a62517a4f60bf/taskwarrior.git/src/recur.cpp:142:9: error: \u2018context\u2019 was not declared in this scope"
"/tmp/taskwarrior.d0bbe2a0e82e83e101943a902f6a62517a4f60bf/taskwarrior.git/src/recur.cpp:142:9: error: \u2018context\u2019 was not declared in this scope"
63.96s
0.00% 0/0
0.10s
0.00% 0/0
W E
"/tmp/taskwarrior.d0bbe2a0e82e83e101943a902f6a62517a4f60bf/taskwarrior.git/src/Variant.cpp:1113:7: warning: this statement may fall through [-Wimplicit-fallthrough=]"
"/tmp/taskwarrior.d0bbe2a0e82e83e101943a902f6a62517a4f60bf/taskwarrior.git/src/recur.cpp:142:9: error: \u2018context\u2019 was not declared in this scope"
"/tmp/taskwarrior.d0bbe2a0e82e83e101943a902f6a62517a4f60bf/taskwarrior.git/src/recur.cpp:142:9: error: \u2018context\u2019 was not declared in this scope"
68.21s
0.00% 0/0
0.08s
0.00% 0/0
0.10s
2018-05-14T05:01:06Z
  7441e6cf Locked
  Simon Ruderich
0.00% 0/0
0.11s
0.00% 0/0
W E
"/tmp/taskwarrior.7441e6cf74277c1a121a62c4daa01203a1578c71/taskwarrior.git/src/Variant.cpp:1113:7: warning: this statement may fall through [-Wimplicit-fallthrough=]"
"/tmp/taskwarrior.7441e6cf74277c1a121a62c4daa01203a1578c71/taskwarrior.git/src/recur.cpp:142:9: error: \u2018context\u2019 was not declared in this scope"
"/tmp/taskwarrior.7441e6cf74277c1a121a62c4daa01203a1578c71/taskwarrior.git/src/recur.cpp:142:9: error: \u2018context\u2019 was not declared in this scope"
65.12s
0.00% 0/0
0.10s
0.00% 0/0
W E
"/tmp/taskwarrior.7441e6cf74277c1a121a62c4daa01203a1578c71/taskwarrior.git/src/Variant.cpp:1113:7: warning: this statement may fall through [-Wimplicit-fallthrough=]"
"/tmp/taskwarrior.7441e6cf74277c1a121a62c4daa01203a1578c71/taskwarrior.git/src/recur.cpp:142:9: error: \u2018context\u2019 was not declared in this scope"
"/tmp/taskwarrior.7441e6cf74277c1a121a62c4daa01203a1578c71/taskwarrior.git/src/recur.cpp:142:9: error: \u2018context\u2019 was not declared in this scope"
65.29s
0.00% 0/0
0.10s
0.00% 0/0
0.11s
2018-05-14T05:00:56Z
  a87dfe62 Locked
  Simon Ruderich
0.00% 0/0
0.10s
0.00% 0/0
W E
"/tmp/taskwarrior.a87dfe62ad025e963e5aa3d3bf0162d4a37bed4f/taskwarrior.git/src/Variant.cpp:1113:7: warning: this statement may fall through [-Wimplicit-fallthrough=]"
"/tmp/taskwarrior.a87dfe62ad025e963e5aa3d3bf0162d4a37bed4f/taskwarrior.git/src/recur.cpp:142:9: error: \u2018context\u2019 was not declared in this scope"
"/tmp/taskwarrior.a87dfe62ad025e963e5aa3d3bf0162d4a37bed4f/taskwarrior.git/src/recur.cpp:142:9: error: \u2018context\u2019 was not declared in this scope"
64.45s
0.00% 0/0
0.12s
0.00% 0/0
W E
"/tmp/taskwarrior.a87dfe62ad025e963e5aa3d3bf0162d4a37bed4f/taskwarrior.git/src/Variant.cpp:1113:7: warning: this statement may fall through [-Wimplicit-fallthrough=]"
"/tmp/taskwarrior.a87dfe62ad025e963e5aa3d3bf0162d4a37bed4f/taskwarrior.git/src/recur.cpp:142:9: error: \u2018context\u2019 was not declared in this scope"
"/tmp/taskwarrior.a87dfe62ad025e963e5aa3d3bf0162d4a37bed4f/taskwarrior.git/src/recur.cpp:142:9: error: \u2018context\u2019 was not declared in this scope"
66.66s
0.00% 0/0
0.08s
0.00% 0/0
0.12s
2018-05-14T05:00:44Z
  02470c56 Locked
  Simon Ruderich
0.00% 0/0
0.11s
0.00% 0/0
W E
"/tmp/taskwarrior.02470c56470ae929fdff378c0df7f25dc8d2cf1c/taskwarrior.git/src/Variant.cpp:1113:7: warning: this statement may fall through [-Wimplicit-fallthrough=]"
"/tmp/taskwarrior.02470c56470ae929fdff378c0df7f25dc8d2cf1c/taskwarrior.git/src/recur.cpp:142:9: error: \u2018context\u2019 was not declared in this scope"
"/tmp/taskwarrior.02470c56470ae929fdff378c0df7f25dc8d2cf1c/taskwarrior.git/src/recur.cpp:142:9: error: \u2018context\u2019 was not declared in this scope"
65.55s
0.00% 0/0
0.12s
0.00% 0/0
W E
"/tmp/taskwarrior.02470c56470ae929fdff378c0df7f25dc8d2cf1c/taskwarrior.git/src/Variant.cpp:1113:7: warning: this statement may fall through [-Wimplicit-fallthrough=]"
"/tmp/taskwarrior.02470c56470ae929fdff378c0df7f25dc8d2cf1c/taskwarrior.git/src/recur.cpp:142:9: error: \u2018context\u2019 was not declared in this scope"
"/tmp/taskwarrior.02470c56470ae929fdff378c0df7f25dc8d2cf1c/taskwarrior.git/src/recur.cpp:142:9: error: \u2018context\u2019 was not declared in this scope"
64.34s
0.00% 0/0
0.08s
0.00% 0/0
0.10s
2018-05-14T05:00:23Z
  c7edf914 Locked
  Simon Ruderich
0.00% 0/0
0.06s
0.00% 0/0
W E
"/tmp/taskwarrior.c7edf914e11ed2610eef28b3bc2ea94225d1fcea/taskwarrior.git/src/Variant.cpp:1113:7: warning: this statement may fall through [-Wimplicit-fallthrough=]"
"/tmp/taskwarrior.c7edf914e11ed2610eef28b3bc2ea94225d1fcea/taskwarrior.git/src/recur.cpp:142:9: error: \u2018context\u2019 was not declared in this scope"
"/tmp/taskwarrior.c7edf914e11ed2610eef28b3bc2ea94225d1fcea/taskwarrior.git/src/recur.cpp:142:9: error: \u2018context\u2019 was not declared in this scope"
64.22s
0.00% 0/0
0.11s
0.00% 0/0
W E
"/tmp/taskwarrior.c7edf914e11ed2610eef28b3bc2ea94225d1fcea/taskwarrior.git/src/Variant.cpp:1113:7: warning: this statement may fall through [-Wimplicit-fallthrough=]"
"/tmp/taskwarrior.c7edf914e11ed2610eef28b3bc2ea94225d1fcea/taskwarrior.git/src/recur.cpp:142:9: error: \u2018context\u2019 was not declared in this scope"
"/tmp/taskwarrior.c7edf914e11ed2610eef28b3bc2ea94225d1fcea/taskwarrior.git/src/recur.cpp:142:9: error: \u2018context\u2019 was not declared in this scope"
61.29s
0.00% 0/0
0.08s
0.00% 0/0
0.11s
2018-05-14T04:57:53Z
  f98084bb Locked
  Simon Ruderich
0.00% 0/0
0.11s
0.00% 0/0
W E
"/tmp/taskwarrior.f98084bbd37522cd85aa9c853e59b2840e5c6d6f/taskwarrior.git/src/Variant.cpp:1113:7: warning: this statement may fall through [-Wimplicit-fallthrough=]"
"/tmp/taskwarrior.f98084bbd37522cd85aa9c853e59b2840e5c6d6f/taskwarrior.git/src/recur.cpp:142:9: error: \u2018context\u2019 was not declared in this scope"
"/tmp/taskwarrior.f98084bbd37522cd85aa9c853e59b2840e5c6d6f/taskwarrior.git/src/recur.cpp:142:9: error: \u2018context\u2019 was not declared in this scope"
68.59s
0.00% 0/0
0.10s
0.00% 0/0
W E
"/tmp/taskwarrior.f98084bbd37522cd85aa9c853e59b2840e5c6d6f/taskwarrior.git/src/Variant.cpp:1113:7: warning: this statement may fall through [-Wimplicit-fallthrough=]"
"/tmp/taskwarrior.f98084bbd37522cd85aa9c853e59b2840e5c6d6f/taskwarrior.git/src/recur.cpp:142:9: error: \u2018context\u2019 was not declared in this scope"
"/tmp/taskwarrior.f98084bbd37522cd85aa9c853e59b2840e5c6d6f/taskwarrior.git/src/recur.cpp:142:9: error: \u2018context\u2019 was not declared in this scope"
64.48s
0.00% 0/0
0.06s
0.00% 0/0
0.12s
2018-05-14T04:57:45Z
  ef538ef9 Locked
  Simon Ruderich
0.00% 0/0
0.11s
0.00% 0/0
W E
"/tmp/taskwarrior.ef538ef9da308e1ac93142a4110cf86e4f8e70d7/taskwarrior.git/src/Variant.cpp:1113:7: warning: this statement may fall through [-Wimplicit-fallthrough=]"
"/tmp/taskwarrior.ef538ef9da308e1ac93142a4110cf86e4f8e70d7/taskwarrior.git/src/recur.cpp:142:9: error: \u2018context\u2019 was not declared in this scope"
"/tmp/taskwarrior.ef538ef9da308e1ac93142a4110cf86e4f8e70d7/taskwarrior.git/src/recur.cpp:142:9: error: \u2018context\u2019 was not declared in this scope"
64.17s
0.00% 0/0
0.10s
0.00% 0/0
W E
"/tmp/taskwarrior.ef538ef9da308e1ac93142a4110cf86e4f8e70d7/taskwarrior.git/src/Variant.cpp:1113:7: warning: this statement may fall through [-Wimplicit-fallthrough=]"
"/tmp/taskwarrior.ef538ef9da308e1ac93142a4110cf86e4f8e70d7/taskwarrior.git/src/recur.cpp:142:9: error: \u2018context\u2019 was not declared in this scope"
"/tmp/taskwarrior.ef538ef9da308e1ac93142a4110cf86e4f8e70d7/taskwarrior.git/src/recur.cpp:142:9: error: \u2018context\u2019 was not declared in this scope"
62.63s
0.00% 0/0
0.05s
0.00% 0/0
0.09s
2018-05-14T04:57:33Z
  f492d423 Locked
  Simon Ruderich
0.00% 0/0
0.09s
0.00% 0/0
W E
"/tmp/taskwarrior.f492d423ddef2cff8eff71082e47ad6286b074d1/taskwarrior.git/src/Variant.cpp:1113:7: warning: this statement may fall through [-Wimplicit-fallthrough=]"
"/tmp/taskwarrior.f492d423ddef2cff8eff71082e47ad6286b074d1/taskwarrior.git/src/recur.cpp:142:9: error: \u2018context\u2019 was not declared in this scope"
"/tmp/taskwarrior.f492d423ddef2cff8eff71082e47ad6286b074d1/taskwarrior.git/src/recur.cpp:142:9: error: \u2018context\u2019 was not declared in this scope"
67.14s
0.00% 0/0
0.09s
0.00% 0/0
W E
"/tmp/taskwarrior.f492d423ddef2cff8eff71082e47ad6286b074d1/taskwarrior.git/src/Variant.cpp:1113:7: warning: this statement may fall through [-Wimplicit-fallthrough=]"
"/tmp/taskwarrior.f492d423ddef2cff8eff71082e47ad6286b074d1/taskwarrior.git/src/recur.cpp:142:9: error: \u2018context\u2019 was not declared in this scope"
"/tmp/taskwarrior.f492d423ddef2cff8eff71082e47ad6286b074d1/taskwarrior.git/src/recur.cpp:142:9: error: \u2018context\u2019 was not declared in this scope"
61.78s
0.00% 0/0
0.06s
0.00% 0/0
0.09s
2018-05-14T04:57:00Z
  abc00ab6 Locked
  Simon Ruderich
0.00% 0/0
0.10s
0.00% 0/0
W E
"/tmp/taskwarrior.abc00ab6ca0f033738b229bdcf8b19814332248d/taskwarrior.git/src/Variant.cpp:1113:7: warning: this statement may fall through [-Wimplicit-fallthrough=]"
"/tmp/taskwarrior.abc00ab6ca0f033738b229bdcf8b19814332248d/taskwarrior.git/src/recur.cpp:142:9: error: \u2018context\u2019 was not declared in this scope"
"/tmp/taskwarrior.abc00ab6ca0f033738b229bdcf8b19814332248d/taskwarrior.git/src/recur.cpp:142:9: error: \u2018context\u2019 was not declared in this scope"
64.62s
0.00% 0/0
0.11s
0.00% 0/0
W E
"/tmp/taskwarrior.abc00ab6ca0f033738b229bdcf8b19814332248d/taskwarrior.git/src/Variant.cpp:1113:7: warning: this statement may fall through [-Wimplicit-fallthrough=]"
"/tmp/taskwarrior.abc00ab6ca0f033738b229bdcf8b19814332248d/taskwarrior.git/src/recur.cpp:142:9: error: \u2018context\u2019 was not declared in this scope"
"/tmp/taskwarrior.abc00ab6ca0f033738b229bdcf8b19814332248d/taskwarrior.git/src/recur.cpp:142:9: error: \u2018context\u2019 was not declared in this scope"
65.98s
0.00% 0/0
0.05s
0.00% 0/0
0.07s
2018-05-14T04:56:49Z
  243f6134 Locked
  Simon Ruderich
0.00% 0/0
0.10s
0.00% 0/0
W E
"/tmp/taskwarrior.243f613444367f3a16d61f40eb941e27cdcc4aca/taskwarrior.git/src/Variant.cpp:1113:7: warning: this statement may fall through [-Wimplicit-fallthrough=]"
"/tmp/taskwarrior.243f613444367f3a16d61f40eb941e27cdcc4aca/taskwarrior.git/src/recur.cpp:142:9: error: \u2018context\u2019 was not declared in this scope"
"/tmp/taskwarrior.243f613444367f3a16d61f40eb941e27cdcc4aca/taskwarrior.git/src/recur.cpp:142:9: error: \u2018context\u2019 was not declared in this scope"
64.67s
0.00% 0/0
0.11s
0.00% 0/0
W E
"/tmp/taskwarrior.243f613444367f3a16d61f40eb941e27cdcc4aca/taskwarrior.git/src/Variant.cpp:1113:7: warning: this statement may fall through [-Wimplicit-fallthrough=]"
"/tmp/taskwarrior.243f613444367f3a16d61f40eb941e27cdcc4aca/taskwarrior.git/src/recur.cpp:142:9: error: \u2018context\u2019 was not declared in this scope"
"/tmp/taskwarrior.243f613444367f3a16d61f40eb941e27cdcc4aca/taskwarrior.git/src/recur.cpp:142:9: error: \u2018context\u2019 was not declared in this scope"
71.58s
0.00% 0/0
0.05s
0.00% 0/0
0.09s
2018-05-14T04:56:33Z
  8fdd18f8 Locked
  Simon Ruderich
0.00% 0/0
0.10s
0.00% 0/0
W E
"/tmp/taskwarrior.8fdd18f897ef6455d975d731137b5712415261a1/taskwarrior.git/src/Variant.cpp:1113:7: warning: this statement may fall through [-Wimplicit-fallthrough=]"
"/tmp/taskwarrior.8fdd18f897ef6455d975d731137b5712415261a1/taskwarrior.git/src/recur.cpp:142:9: error: \u2018context\u2019 was not declared in this scope"
"/tmp/taskwarrior.8fdd18f897ef6455d975d731137b5712415261a1/taskwarrior.git/src/recur.cpp:142:9: error: \u2018context\u2019 was not declared in this scope"
63.71s
0.00% 0/0
0.11s
0.00% 0/0
W E
"/tmp/taskwarrior.8fdd18f897ef6455d975d731137b5712415261a1/taskwarrior.git/src/Variant.cpp:1113:7: warning: this statement may fall through [-Wimplicit-fallthrough=]"
"/tmp/taskwarrior.8fdd18f897ef6455d975d731137b5712415261a1/taskwarrior.git/src/recur.cpp:142:9: error: \u2018context\u2019 was not declared in this scope"
"/tmp/taskwarrior.8fdd18f897ef6455d975d731137b5712415261a1/taskwarrior.git/src/recur.cpp:142:9: error: \u2018context\u2019 was not declared in this scope"
67.31s
0.00% 0/0
0.06s
0.00% 0/0
0.06s
2018-05-14T04:56:25Z
  822909d0 Locked
  Paul Beckingham
0.00% 0/0
0.07s
0.00% 0/0
W E
"/tmp/taskwarrior.822909d0464b172353967c06020888ba95e7d84c/taskwarrior.git/src/Variant.cpp:1113:7: warning: this statement may fall through [-Wimplicit-fallthrough=]"
"/tmp/taskwarrior.822909d0464b172353967c06020888ba95e7d84c/taskwarrior.git/src/recur.cpp:142:9: error: \u2018context\u2019 was not declared in this scope"
"/tmp/taskwarrior.822909d0464b172353967c06020888ba95e7d84c/taskwarrior.git/src/recur.cpp:142:9: error: \u2018context\u2019 was not declared in this scope"
65.21s
0.00% 0/0
0.08s
0.00% 0/0
W E
"/tmp/taskwarrior.822909d0464b172353967c06020888ba95e7d84c/taskwarrior.git/src/Variant.cpp:1113:7: warning: this statement may fall through [-Wimplicit-fallthrough=]"
"/tmp/taskwarrior.822909d0464b172353967c06020888ba95e7d84c/taskwarrior.git/src/recur.cpp:142:9: error: \u2018context\u2019 was not declared in this scope"
"/tmp/taskwarrior.822909d0464b172353967c06020888ba95e7d84c/taskwarrior.git/src/recur.cpp:142:9: error: \u2018context\u2019 was not declared in this scope"
63.61s
0.00% 0/0
0.05s
0.00% 0/0
0.05s
2018-05-14T04:56:08Z
  95becc4f Locked
  Tiago Matias
0.00% 0/0
0.12s
0.00% 0/0
W E
"/tmp/taskwarrior.95becc4f6f93a68a7cd6b5ec186d54571c217c9d/taskwarrior.git/src/Variant.cpp:1113:7: warning: this statement may fall through [-Wimplicit-fallthrough=]"
"/tmp/taskwarrior.95becc4f6f93a68a7cd6b5ec186d54571c217c9d/taskwarrior.git/src/recur.cpp:142:9: error: \u2018context\u2019 was not declared in this scope"
"/tmp/taskwarrior.95becc4f6f93a68a7cd6b5ec186d54571c217c9d/taskwarrior.git/src/recur.cpp:142:9: error: \u2018context\u2019 was not declared in this scope"
63.74s
0.00% 0/0
0.08s
0.00% 0/0
W E
"/tmp/taskwarrior.95becc4f6f93a68a7cd6b5ec186d54571c217c9d/taskwarrior.git/src/Variant.cpp:1113:7: warning: this statement may fall through [-Wimplicit-fallthrough=]"
"/tmp/taskwarrior.95becc4f6f93a68a7cd6b5ec186d54571c217c9d/taskwarrior.git/src/recur.cpp:142:9: error: \u2018context\u2019 was not declared in this scope"
"/tmp/taskwarrior.95becc4f6f93a68a7cd6b5ec186d54571c217c9d/taskwarrior.git/src/recur.cpp:142:9: error: \u2018context\u2019 was not declared in this scope"
66.14s
0.00% 0/0
0.05s
0.00% 0/0
0.06s
2018-05-14T04:55:57Z
  11a281b8 Locked
  Federico Hernandez
0.00% 0/0
0.10s
0.00% 0/0
W E
"/tmp/taskwarrior.11a281b862b4107a1e370acb9c442ff8be3f39fe/taskwarrior.git/src/Variant.cpp:1113:7: warning: this statement may fall through [-Wimplicit-fallthrough=]"
"/tmp/taskwarrior.11a281b862b4107a1e370acb9c442ff8be3f39fe/taskwarrior.git/src/recur.cpp:142:9: error: \u2018context\u2019 was not declared in this scope"
"/tmp/taskwarrior.11a281b862b4107a1e370acb9c442ff8be3f39fe/taskwarrior.git/src/recur.cpp:142:9: error: \u2018context\u2019 was not declared in this scope"
65.29s
0.00% 0/0
0.09s
0.00% 0/0
W E
"/tmp/taskwarrior.11a281b862b4107a1e370acb9c442ff8be3f39fe/taskwarrior.git/src/Variant.cpp:1113:7: warning: this statement may fall through [-Wimplicit-fallthrough=]"
"/tmp/taskwarrior.11a281b862b4107a1e370acb9c442ff8be3f39fe/taskwarrior.git/src/recur.cpp:142:9: error: \u2018context\u2019 was not declared in this scope"
"/tmp/taskwarrior.11a281b862b4107a1e370acb9c442ff8be3f39fe/taskwarrior.git/src/recur.cpp:142:9: error: \u2018context\u2019 was not declared in this scope"
74.59s
0.00% 0/0
0.05s
0.00% 0/0
0.07s
2018-05-14T04:55:45Z
  b97e1400 Locked
  Federico Hernandez
0.00% 0/0
0.08s
0.00% 0/0
W E
"/tmp/taskwarrior.b97e1400e62c4462197e8aa593912856ec2f0e2d/taskwarrior.git/src/Variant.cpp:1113:7: warning: this statement may fall through [-Wimplicit-fallthrough=]"
"/tmp/taskwarrior.b97e1400e62c4462197e8aa593912856ec2f0e2d/taskwarrior.git/src/recur.cpp:142:9: error: \u2018context\u2019 was not declared in this scope"
"/tmp/taskwarrior.b97e1400e62c4462197e8aa593912856ec2f0e2d/taskwarrior.git/src/recur.cpp:142:9: error: \u2018context\u2019 was not declared in this scope"
61.72s
0.00% 0/0
0.05s
0.00% 0/0
W E
"/tmp/taskwarrior.b97e1400e62c4462197e8aa593912856ec2f0e2d/taskwarrior.git/src/Variant.cpp:1113:7: warning: this statement may fall through [-Wimplicit-fallthrough=]"
"/tmp/taskwarrior.b97e1400e62c4462197e8aa593912856ec2f0e2d/taskwarrior.git/src/recur.cpp:142:9: error: \u2018context\u2019 was not declared in this scope"
"/tmp/taskwarrior.b97e1400e62c4462197e8aa593912856ec2f0e2d/taskwarrior.git/src/recur.cpp:142:9: error: \u2018context\u2019 was not declared in this scope"
59.75s
0.00% 0/0
0.05s
0.00% 0/0
0.04s
2018-05-14T04:55:30Z
  a8c0646d Locked
  Federico Hernandez
0.00% 0/0
0.09s
0.00% 0/0
W E
"/tmp/taskwarrior.a8c0646d1873cf8c2b52b59eb236f11c98a0b3bb/taskwarrior.git/src/Variant.cpp:1113:7: warning: this statement may fall through [-Wimplicit-fallthrough=]"
"/tmp/taskwarrior.a8c0646d1873cf8c2b52b59eb236f11c98a0b3bb/taskwarrior.git/src/recur.cpp:142:9: error: \u2018context\u2019 was not declared in this scope"
"/tmp/taskwarrior.a8c0646d1873cf8c2b52b59eb236f11c98a0b3bb/taskwarrior.git/src/recur.cpp:142:9: error: \u2018context\u2019 was not declared in this scope"
64.18s
0.00% 0/0
0.12s
0.00% 0/0
W E
"/tmp/taskwarrior.a8c0646d1873cf8c2b52b59eb236f11c98a0b3bb/taskwarrior.git/src/Variant.cpp:1113:7: warning: this statement may fall through [-Wimplicit-fallthrough=]"
"/tmp/taskwarrior.a8c0646d1873cf8c2b52b59eb236f11c98a0b3bb/taskwarrior.git/src/recur.cpp:142:9: error: \u2018context\u2019 was not declared in this scope"
"/tmp/taskwarrior.a8c0646d1873cf8c2b52b59eb236f11c98a0b3bb/taskwarrior.git/src/recur.cpp:142:9: error: \u2018context\u2019 was not declared in this scope"
64.38s
0.00% 0/0
0.05s
0.00% 0/0
0.07s
2018-05-14T04:54:42Z
  98175bac Locked
  Federico Hernandez
0.00% 0/0
0.10s
0.00% 0/0
W E
"/tmp/taskwarrior.98175bac4bf4d55e519b2fc3ff112239e59c62ba/taskwarrior.git/src/Variant.cpp:1113:7: warning: this statement may fall through [-Wimplicit-fallthrough=]"
"/tmp/taskwarrior.98175bac4bf4d55e519b2fc3ff112239e59c62ba/taskwarrior.git/src/recur.cpp:142:9: error: \u2018context\u2019 was not declared in this scope"
"/tmp/taskwarrior.98175bac4bf4d55e519b2fc3ff112239e59c62ba/taskwarrior.git/src/recur.cpp:142:9: error: \u2018context\u2019 was not declared in this scope"
63.84s
0.00% 0/0
0.07s
0.00% 0/0
W E
"/tmp/taskwarrior.98175bac4bf4d55e519b2fc3ff112239e59c62ba/taskwarrior.git/src/Variant.cpp:1113:7: warning: this statement may fall through [-Wimplicit-fallthrough=]"
"/tmp/taskwarrior.98175bac4bf4d55e519b2fc3ff112239e59c62ba/taskwarrior.git/src/recur.cpp:142:9: error: \u2018context\u2019 was not declared in this scope"
"/tmp/taskwarrior.98175bac4bf4d55e519b2fc3ff112239e59c62ba/taskwarrior.git/src/recur.cpp:142:9: error: \u2018context\u2019 was not declared in this scope"
65.05s
0.00% 0/0
0.05s
0.00% 0/0
0.08s
2018-05-14T04:54:33Z
  81e65b43 Locked
  Paul Beckingham
0.00% 0/0
0.09s
0.00% 0/0
W E
"/tmp/taskwarrior.81e65b43bf11d7ae0cbeeac5dec1d3ffc18a2d10/taskwarrior.git/src/Variant.cpp:1113:7: warning: this statement may fall through [-Wimplicit-fallthrough=]"
"/tmp/taskwarrior.81e65b43bf11d7ae0cbeeac5dec1d3ffc18a2d10/taskwarrior.git/src/recur.cpp:142:9: error: \u2018context\u2019 was not declared in this scope"
"/tmp/taskwarrior.81e65b43bf11d7ae0cbeeac5dec1d3ffc18a2d10/taskwarrior.git/src/recur.cpp:142:9: error: \u2018context\u2019 was not declared in this scope"
64.66s
0.00% 0/0
0.09s
0.00% 0/0
0.45s
0.00% 0/0
0.05s
0.00% 0/0
0.04s
2018-05-14T04:54:10Z
  23d63ccb Locked
  Jakub Wilk
0.00% 0/0
0.05s
0.00% 0/0
W E
"/tmp/taskwarrior.23d63ccb44e98b9d2c3458750691a0ae1daa44ff/taskwarrior.git/src/Variant.cpp:1113:7: warning: this statement may fall through [-Wimplicit-fallthrough=]"
"/tmp/taskwarrior.23d63ccb44e98b9d2c3458750691a0ae1daa44ff/taskwarrior.git/src/recur.cpp:142:9: error: \u2018context\u2019 was not declared in this scope"
"/tmp/taskwarrior.23d63ccb44e98b9d2c3458750691a0ae1daa44ff/taskwarrior.git/src/recur.cpp:142:9: error: \u2018context\u2019 was not declared in this scope"
65.32s
0.00% 0/0
0.07s
0.00% 0/0
W E
"/tmp/taskwarrior.23d63ccb44e98b9d2c3458750691a0ae1daa44ff/taskwarrior.git/src/Variant.cpp:1113:7: warning: this statement may fall through [-Wimplicit-fallthrough=]"
"/tmp/taskwarrior.23d63ccb44e98b9d2c3458750691a0ae1daa44ff/taskwarrior.git/src/recur.cpp:142:9: error: \u2018context\u2019 was not declared in this scope"
"/tmp/taskwarrior.23d63ccb44e98b9d2c3458750691a0ae1daa44ff/taskwarrior.git/src/recur.cpp:142:9: error: \u2018context\u2019 was not declared in this scope"
65.47s
0.00% 0/0
0.05s
0.00% 0/0
0.03s
2018-05-14T04:53:49Z
  59342bc1 Locked
  Paul Beckingham
0.00% 0/0
0.07s
0.00% 0/0
W E
"/tmp/taskwarrior.59342bc10fd96b4306f58ae09205172564447f92/taskwarrior.git/src/Variant.cpp:1113:7: warning: this statement may fall through [-Wimplicit-fallthrough=]"
"/tmp/taskwarrior.59342bc10fd96b4306f58ae09205172564447f92/taskwarrior.git/src/recur.cpp:142:9: error: \u2018context\u2019 was not declared in this scope"
"/tmp/taskwarrior.59342bc10fd96b4306f58ae09205172564447f92/taskwarrior.git/src/recur.cpp:142:9: error: \u2018context\u2019 was not declared in this scope"
65.08s
0.00% 0/0
0.10s
0.00% 0/0
W E
"/tmp/taskwarrior.59342bc10fd96b4306f58ae09205172564447f92/taskwarrior.git/src/Variant.cpp:1113:7: warning: this statement may fall through [-Wimplicit-fallthrough=]"
"/tmp/taskwarrior.59342bc10fd96b4306f58ae09205172564447f92/taskwarrior.git/src/recur.cpp:142:9: error: \u2018context\u2019 was not declared in this scope"
"/tmp/taskwarrior.59342bc10fd96b4306f58ae09205172564447f92/taskwarrior.git/src/recur.cpp:142:9: error: \u2018context\u2019 was not declared in this scope"
65.38s
0.00% 0/0
0.05s
0.00% 0/0
0.11s
2018-05-14T04:53:40Z
  ea81976e Locked
  Paul Beckingham
0.00% 0/0
0.09s
0.00% 0/0
W E
"/tmp/taskwarrior.ea81976ee9083aae2375936ef38a3d5da81dc453/taskwarrior.git/src/Variant.cpp:1113:7: warning: this statement may fall through [-Wimplicit-fallthrough=]"
"/tmp/taskwarrior.ea81976ee9083aae2375936ef38a3d5da81dc453/taskwarrior.git/src/recur.cpp:142:9: error: \u2018context\u2019 was not declared in this scope"
"/tmp/taskwarrior.ea81976ee9083aae2375936ef38a3d5da81dc453/taskwarrior.git/src/recur.cpp:142:9: error: \u2018context\u2019 was not declared in this scope"
62.35s
0.00% 0/0
0.11s
0.00% 0/0
0.44s
0.00% 0/0
0.05s
0.00% 0/0
0.07s
2018-05-14T04:53:32Z
  53088dae Locked
  Paul Beckingham
0.00% 0/0
0.07s
0.00% 0/0
W E
"/tmp/taskwarrior.53088dae659e14ab01bba4436272f07cc8937d08/taskwarrior.git/src/Variant.cpp:1113:7: warning: this statement may fall through [-Wimplicit-fallthrough=]"
"/tmp/taskwarrior.53088dae659e14ab01bba4436272f07cc8937d08/taskwarrior.git/src/recur.cpp:142:9: error: \u2018context\u2019 was not declared in this scope"
"/tmp/taskwarrior.53088dae659e14ab01bba4436272f07cc8937d08/taskwarrior.git/src/recur.cpp:142:9: error: \u2018context\u2019 was not declared in this scope"
63.35s
0.00% 0/0
0.04s
0.00% 0/0
W E
"/tmp/taskwarrior.53088dae659e14ab01bba4436272f07cc8937d08/taskwarrior.git/src/Variant.cpp:1113:7: warning: this statement may fall through [-Wimplicit-fallthrough=]"
"/tmp/taskwarrior.53088dae659e14ab01bba4436272f07cc8937d08/taskwarrior.git/src/recur.cpp:142:9: error: \u2018context\u2019 was not declared in this scope"
"/tmp/taskwarrior.53088dae659e14ab01bba4436272f07cc8937d08/taskwarrior.git/src/recur.cpp:142:9: error: \u2018context\u2019 was not declared in this scope"
65.81s
0.00% 0/0
0.06s
0.00% 0/0
0.05s
2018-05-14T04:53:09Z
  2623d101 Locked
  Paul Beckingham
0.00% 0/0
0.06s
0.00% 0/0
W E
"/tmp/taskwarrior.2623d101e7027975ccbd424f77391910911e354d/taskwarrior.git/src/Variant.cpp:1113:7: warning: this statement may fall through [-Wimplicit-fallthrough=]"
"/tmp/taskwarrior.2623d101e7027975ccbd424f77391910911e354d/taskwarrior.git/src/recur.cpp:142:9: error: \u2018context\u2019 was not declared in this scope"
"/tmp/taskwarrior.2623d101e7027975ccbd424f77391910911e354d/taskwarrior.git/src/recur.cpp:142:9: error: \u2018context\u2019 was not declared in this scope"
60.76s
0.00% 0/0
0.06s
0.00% 0/0
W E
"/tmp/taskwarrior.2623d101e7027975ccbd424f77391910911e354d/taskwarrior.git/src/Variant.cpp:1113:7: warning: this statement may fall through [-Wimplicit-fallthrough=]"
"/tmp/taskwarrior.2623d101e7027975ccbd424f77391910911e354d/taskwarrior.git/src/recur.cpp:142:9: error: \u2018context\u2019 was not declared in this scope"
"/tmp/taskwarrior.2623d101e7027975ccbd424f77391910911e354d/taskwarrior.git/src/recur.cpp:142:9: error: \u2018context\u2019 was not declared in this scope"
63.13s
0.00% 0/0
0.02s
0.00% 0/0
0.05s
2018-05-14T04:52:45Z
  4f7ca3f2 Locked
  Paul Beckingham
0.00% 0/0
0.15s
0.00% 0/0
W E
"/tmp/taskwarrior.4f7ca3f2d1eb78e34a1f3997a3648fffdd9064b4/taskwarrior.git/src/Variant.cpp:1113:7: warning: this statement may fall through [-Wimplicit-fallthrough=]"
"/tmp/taskwarrior.4f7ca3f2d1eb78e34a1f3997a3648fffdd9064b4/taskwarrior.git/src/recur.cpp:142:9: error: \u2018context\u2019 was not declared in this scope"
"/tmp/taskwarrior.4f7ca3f2d1eb78e34a1f3997a3648fffdd9064b4/taskwarrior.git/src/recur.cpp:142:9: error: \u2018context\u2019 was not declared in this scope"
63.12s
0.00% 0/0
0.12s
0.00% 0/0
W E
"/tmp/taskwarrior.4f7ca3f2d1eb78e34a1f3997a3648fffdd9064b4/taskwarrior.git/src/Variant.cpp:1113:7: warning: this statement may fall through [-Wimplicit-fallthrough=]"
"/tmp/taskwarrior.4f7ca3f2d1eb78e34a1f3997a3648fffdd9064b4/taskwarrior.git/src/recur.cpp:142:9: error: \u2018context\u2019 was not declared in this scope"
"/tmp/taskwarrior.4f7ca3f2d1eb78e34a1f3997a3648fffdd9064b4/taskwarrior.git/src/recur.cpp:142:9: error: \u2018context\u2019 was not declared in this scope"
65.45s
0.00% 0/0
0.11s
0.00% 0/0
0.07s
2018-05-14T04:52:07Z
  0411fd1d Locked
  Dirk Deimeke
0.00% 0/0
0.13s
0.00% 0/0
W E
"/tmp/taskwarrior.0411fd1ddcd9ba7e1e9958280bff93c3a38f0a5c/taskwarrior.git/src/Variant.cpp:1113:7: warning: this statement may fall through [-Wimplicit-fallthrough=]"
"/tmp/taskwarrior.0411fd1ddcd9ba7e1e9958280bff93c3a38f0a5c/taskwarrior.git/src/recur.cpp:142:9: error: \u2018context\u2019 was not declared in this scope"
"/tmp/taskwarrior.0411fd1ddcd9ba7e1e9958280bff93c3a38f0a5c/taskwarrior.git/src/recur.cpp:142:9: error: \u2018context\u2019 was not declared in this scope"
68.96s
0.00% 0/0
0.10s
0.00% 0/0
W E
"/tmp/taskwarrior.0411fd1ddcd9ba7e1e9958280bff93c3a38f0a5c/taskwarrior.git/src/Variant.cpp:1113:7: warning: this statement may fall through [-Wimplicit-fallthrough=]"
"/tmp/taskwarrior.0411fd1ddcd9ba7e1e9958280bff93c3a38f0a5c/taskwarrior.git/src/recur.cpp:142:9: error: \u2018context\u2019 was not declared in this scope"
"/tmp/taskwarrior.0411fd1ddcd9ba7e1e9958280bff93c3a38f0a5c/taskwarrior.git/src/recur.cpp:142:9: error: \u2018context\u2019 was not declared in this scope"
62.81s
0.00% 0/0
0.12s
0.00% 0/0
0.07s
2018-05-14T04:51:53Z
  eed96641 Locked
  Paul Beckingham
0.00% 0/0
0.08s
0.00% 0/0
W E
"/tmp/taskwarrior.eed9664173fb7b6f7b2875b6a247131c0e61d6d1/taskwarrior.git/src/Variant.cpp:1113:7: warning: this statement may fall through [-Wimplicit-fallthrough=]"
"/tmp/taskwarrior.eed9664173fb7b6f7b2875b6a247131c0e61d6d1/taskwarrior.git/src/recur.cpp:142:9: error: \u2018context\u2019 was not declared in this scope"
"/tmp/taskwarrior.eed9664173fb7b6f7b2875b6a247131c0e61d6d1/taskwarrior.git/src/recur.cpp:142:9: error: \u2018context\u2019 was not declared in this scope"
66.05s
0.00% 0/0
0.08s
0.00% 0/0
W E
"/tmp/taskwarrior.eed9664173fb7b6f7b2875b6a247131c0e61d6d1/taskwarrior.git/src/Variant.cpp:1113:7: warning: this statement may fall through [-Wimplicit-fallthrough=]"
"/tmp/taskwarrior.eed9664173fb7b6f7b2875b6a247131c0e61d6d1/taskwarrior.git/src/recur.cpp:142:9: error: \u2018context\u2019 was not declared in this scope"
"/tmp/taskwarrior.eed9664173fb7b6f7b2875b6a247131c0e61d6d1/taskwarrior.git/src/recur.cpp:142:9: error: \u2018context\u2019 was not declared in this scope"
62.08s
0.00% 0/0
0.09s
0.00% 0/0
0.07s
2018-05-14T04:51:00Z
  7410b01c Locked
  Paul Beckingham
0.00% 0/0
0.13s
0.00% 0/0
W E
"/tmp/taskwarrior.7410b01cadbf77efe17441d133f2d019ce0a48ef/taskwarrior.git/src/Variant.cpp:1113:7: warning: this statement may fall through [-Wimplicit-fallthrough=]"
"/tmp/taskwarrior.7410b01cadbf77efe17441d133f2d019ce0a48ef/taskwarrior.git/src/recur.cpp:142:9: error: \u2018context\u2019 was not declared in this scope"
"/tmp/taskwarrior.7410b01cadbf77efe17441d133f2d019ce0a48ef/taskwarrior.git/src/recur.cpp:142:9: error: \u2018context\u2019 was not declared in this scope"
64.10s
0.00% 0/0
0.06s
0.00% 0/0
W E
"/tmp/taskwarrior.7410b01cadbf77efe17441d133f2d019ce0a48ef/taskwarrior.git/src/Variant.cpp:1113:7: warning: this statement may fall through [-Wimplicit-fallthrough=]"
"/tmp/taskwarrior.7410b01cadbf77efe17441d133f2d019ce0a48ef/taskwarrior.git/src/recur.cpp:142:9: error: \u2018context\u2019 was not declared in this scope"
"/tmp/taskwarrior.7410b01cadbf77efe17441d133f2d019ce0a48ef/taskwarrior.git/src/recur.cpp:142:9: error: \u2018context\u2019 was not declared in this scope"
65.31s
0.00% 0/0
0.07s
0.00% 0/0
0.08s

742 commits not shown.